{"text_format":"1","workbook":"xlsx","n_sheets":7,"sheets":["DialogFile","GL Template","Instructions","Web Links","Drop Downs","SOAP","Change Log"],"not_rendered":{"charts":0,"images":1,"macros":1,"external_links":0,"defined_names":1139,"comments":1,"pivot_tables":0},"unopened":[{"sheet":"DialogFile","index":0,"reason":"not_a_worksheet"}],"bounds":{"document_bytes":16777216,"sheet_cells":100000,"rows_first":2000,"rows_last":500,"rows_between":2000,"halvings":0,"cell_chars":16384,"cell_head_chars":4096},"cells_cut":0,"cells_raw":0,"read":"whole","date_system":"1900"}

{"sheet":"GL Template","index":1,"n_rows":516,"n_cols":17,"rows_kept":516,"cut":false,"hidden":false,"merged":[[7,1,7,13],[8,3,8,4],[9,3,9,4],[11,0,11,6],[12,0,12,6],[11,7,11,8],[12,7,12,8],[8,1,8,2],[9,1,9,2]]}
[]
[]
[null,null,null,null,null,null,null,null,null,null,"Created by:"]
[null,null,null,null,null,null,null,null,null,null,"Dept Approval:"]
[null,null,null,null,null,null,null,null,null,null,"Entered in PS by:"]
[null,null,null,null,null,null,null,null,null,null,"UC Approval:"]
[null,null,null,null,null,"UMASS Lowell",null,null,null,null,"Journal ID:"]
[null,"                                                    Journal Entry"]
[null,"Business Unit",null,"Journal ID",null,"Journal Date","Ledger","Journal Source",null,null,"Reversal Date","Reversal Code","BU_ID"]
[null,"UMLOW",null,null,null,null,"ACTUALS","ONL",{"$f":"\"c:\\Transfer\\\"&N13&\".txt\"","v":"c:\\Transfer\\1.txt"},null,null,"N - Do Not Generate Reversal",{"$f":"B10","v":"UMLOW"}]
[]
["Header Description (30)",null,null,null,null,null,null,"Header Reference",null,null,"Total Lines"," Total Debits","Net Debit/Credit","Upload name"]
[null,null,null,null,null,null,null,null,null,null,{"$f":"MAX(JrnlLn1)","v":1},{"$f":"ROUND(SUMIF(MonetaryAmount1, \">0\",MonetaryAmount1),2)","v":0},{"$f":"ROUND(SUM(MonetaryAmount1),2)","v":0},"1"]
[]
["Line","Business Unit","Account","Speed Chart","Fund","DeptID","Program","Class","Project/Grant","Analysis Type","Monetary Amount","Line Description (30)",null,"Line Reference"]
{"$rows_left_out":502}
{"sheet":"Instructions","index":2,"n_rows":54,"n_cols":7,"rows_kept":54,"cut":false,"hidden":false,"merged":[]}
["JOURNAL ENTRY FORM INSTRUCTIONS FOR DECENTRAL USERS"]
[]
["The Journal Entry Form is to be used to record financial information in PeopleSoft applicable to your department.  Use it for:"]
["·         Revenue/Expense Corrections/Adjustments/Accruals"]
["·         Cross Campus Transactions"]
[]
["Do not use this form to correct Accounts Payable and Payroll Expenses. "]
[]
["When completed, forward the Journal Entry via email to:",null,null,null,null,null,"UMSOJournalEntry@umassp.edu"]
[]
[]
["FORM FIELD INSTRUCTIONS"]
[]
["This form is used by Controller's Office as the means for directly uploading department prepared entries into PeopleSoft.   "]
["Certain fields are restricted for Controller's Office uses only.  Usually they are password protected to prevent department "]
{"$rows_left_out":40}
{"sheet":"Web Links","index":3,"n_rows":503,"n_cols":18,"rows_kept":503,"cut":false,"hidden":true,"merged":[]}
["Business Unit","Account Code","Fund","DeptID","Program","Project","Class",null,null,null,null,null,null,"Fund","Department","Program","Class","Project"]
[{"$f":"IF('GL Template'!B16<>\"\",'GL Template'!B16,0)","v":"UMLOW"},{"$f":"IF('GL Template'!D16<>\"\",'GL Template'!D16,0)","v":0},"Error",null,null,null,null,null,null,null,null,null,null,{"$f":"IF(OR(LEFT('Web Links'!$C2,2)=\"In\",$C2=\"Error\"),\"?????\",\"\"&C2)","v":"?????"},{"$f":"IF(OR(LEFT('Web Links'!$C2,2)=\"In\",$C2=\"Error\"),\"??????????\",\"\"&D2)","v":"??????????"},{"$f":"IF(OR(LEFT('Web Links'!$C2,2)=\"In\",$C2=\"Error\"),\"???\",IF(LEN(E2)=2,\"0\",IF(LEN(E2)=1,\"00\",\"\")))&'Web Links'!E2","v":"???"},{"$f":"IF(OR(LEFT('Web Links'!$C2,2)=\"In\",$C2=\"Error\"),\"?????\",IF(LEN(G2)=4,\"\",IF(LEN(G2)=3,\"\",IF(LEN(G2)=2,\"\",IF(LEN(G2)=1,\"\",\"\"))))&'Web Links'!G2)","v":"?????"},{"$f":"IF(OR(LEFT('Web Links'!$C2,2)=\"In\",$C2=\"Error\"),\"???????????????\",\"\"&F2)","v":"???????????????"}]
[{"$f":"IF('GL Template'!B17<>\"\",'GL Template'!B17,0)","v":0},{"$f":"IF('GL Template'!D17<>\"\",'GL Template'!D17,0)","v":0},"Error",null,null,null,null,null,null,null,null,null,null,{"$f":"IF(OR(LEFT('Web Links'!$C3,2)=\"In\",$C3=\"Error\"),\"?????\",\"\"&C3)","v":"?????"},{"$f":"IF(OR(LEFT('Web Links'!$C3,2)=\"In\",$C3=\"Error\"),\"??????????\",\"\"&D3)","v":"??????????"},{"$f":"IF(OR(LEFT('Web Links'!$C3,2)=\"In\",$C3=\"Error\"),\"???\",IF(LEN(E3)=2,\"0\",IF(LEN(E3)=1,\"00\",\"\")))&'Web Links'!E3","v":"???"},{"$f":"IF(OR(LEFT('Web Links'!$C3,2)=\"In\",$C3=\"Error\"),\"?????\",IF(LEN(G3)=4,\"\",IF(LEN(G3)=3,\"\",IF(LEN(G3)=2,\"\",IF(LEN(G3)=1,\"\",\"\"))))&'Web Links'!G3)","v":"?????"},{"$f":"IF(OR(LEFT('Web Links'!$C3,2)=\"In\",$C3=\"Error\"),\"???????????????\",\"\"&F3)","v":"???????????????"}]
[{"$f":"IF('GL Template'!B18<>\"\",'GL Template'!B18,0)","v":0},{"$f":"IF('GL Template'!D18<>\"\",'GL Template'!D18,0)","v":0},"Error",null,null,null,null,null,null,null,null,null,null,{"$f":"IF(OR(LEFT('Web Links'!$C4,2)=\"In\",$C4=\"Error\"),\"?????\",\"\"&C4)","v":"?????"},{"$f":"IF(OR(LEFT('Web Links'!$C4,2)=\"In\",$C4=\"Error\"),\"??????????\",\"\"&D4)","v":"??????????"},{"$f":"IF(OR(LEFT('Web Links'!$C4,2)=\"In\",$C4=\"Error\"),\"???\",IF(LEN(E4)=2,\"0\",IF(LEN(E4)=1,\"00\",\"\")))&'Web Links'!E4","v":"???"},{"$f":"IF(OR(LEFT('Web Links'!$C4,2)=\"In\",$C4=\"Error\"),\"?????\",IF(LEN(G4)=4,\"\",IF(LEN(G4)=3,\"\",IF(LEN(G4)=2,\"\",IF(LEN(G4)=1,\"\",\"\"))))&'Web Links'!G4)","v":"?????"},{"$f":"IF(OR(LEFT('Web Links'!$C4,2)=\"In\",$C4=\"Error\"),\"???????????????\",\"\"&F4)","v":"???????????????"}]
[{"$f":"IF('GL Template'!B19<>\"\",'GL Template'!B19,0)","v":0},{"$f":"IF('GL Template'!D19<>\"\",'GL Template'!D19,0)","v":0},"Error",null,null,null,null,null,null,null,null,null,null,{"$f":"IF(OR(LEFT('Web Links'!$C5,2)=\"In\",$C5=\"Error\"),\"?????\",\"\"&C5)","v":"?????"},{"$f":"IF(OR(LEFT('Web Links'!$C5,2)=\"In\",$C5=\"Error\"),\"??????????\",\"\"&D5)","v":"??????????"},{"$f":"IF(OR(LEFT('Web Links'!$C5,2)=\"In\",$C5=\"Error\"),\"???\",IF(LEN(E5)=2,\"0\",IF(LEN(E5)=1,\"00\",\"\")))&'Web Links'!E5","v":"???"},{"$f":"IF(OR(LEFT('Web Links'!$C5,2)=\"In\",$C5=\"Error\"),\"?????\",IF(LEN(G5)=4,\"\",IF(LEN(G5)=3,\"\",IF(LEN(G5)=2,\"\",IF(LEN(G5)=1,\"\",\"\"))))&'Web Links'!G5)","v":"?????"},{"$f":"IF(OR(LEFT('Web Links'!$C5,2)=\"In\",$C5=\"Error\"),\"???????????????\",\"\"&F5)","v":"???????????????"}]
[{"$f":"IF('GL Template'!B20<>\"\",'GL Template'!B20,0)","v":0},{"$f":"IF('GL Template'!D20<>\"\",'GL Template'!D20,0)","v":0},"Error",null,null,null,null,null,null,null,null,null,null,{"$f":"IF(OR(LEFT('Web Links'!$C6,2)=\"In\",$C6=\"Error\"),\"?????\",\"\"&C6)","v":"?????"},{"$f":"IF(OR(LEFT('Web Links'!$C6,2)=\"In\",$C6=\"Error\"),\"??????????\",\"\"&D6)","v":"??????????"},{"$f":"IF(OR(LEFT('Web Links'!$C6,2)=\"In\",$C6=\"Error\"),\"???\",IF(LEN(E6)=2,\"0\",IF(LEN(E6)=1,\"00\",\"\")))&'Web Links'!E6","v":"???"},{"$f":"IF(OR(LEFT('Web Links'!$C6,2)=\"In\",$C6=\"Error\"),\"?????\",IF(LEN(G6)=4,\"\",IF(LEN(G6)=3,\"\",IF(LEN(G6)=2,\"\",IF(LEN(G6)=1,\"\",\"\"))))&'Web Links'!G6)","v":"?????"},{"$f":"IF(OR(LEFT('Web Links'!$C6,2)=\"In\",$C6=\"Error\"),\"???????????????\",\"\"&F6)","v":"???????????????"}]
[{"$f":"IF('GL Template'!B21<>\"\",'GL Template'!B21,0)","v":0},{"$f":"IF('GL Template'!D21<>\"\",'GL Template'!D21,0)","v":0},"Error",null,null,null,null,null,null,null,null,null,null,{"$f":"IF(OR(LEFT('Web Links'!$C7,2)=\"In\",$C7=\"Error\"),\"?????\",\"\"&C7)","v":"?????"},{"$f":"IF(OR(LEFT('Web Links'!$C7,2)=\"In\",$C7=\"Error\"),\"??????????\",\"\"&D7)","v":"??????????"},{"$f":"IF(OR(LEFT('Web Links'!$C7,2)=\"In\",$C7=\"Error\"),\"???\",IF(LEN(E7)=2,\"0\",IF(LEN(E7)=1,\"00\",\"\")))&'Web Links'!E7","v":"???"},{"$f":"IF(OR(LEFT('Web Links'!$C7,2)=\"In\",$C7=\"Error\"),\"?????\",IF(LEN(G7)=4,\"\",IF(LEN(G7)=3,\"\",IF(LEN(G7)=2,\"\",IF(LEN(G7)=1,\"\",\"\"))))&'Web Links'!G7)","v":"?????"},{"$f":"IF(OR(LEFT('Web Links'!$C7,2)=\"In\",$C7=\"Error\"),\"???????????????\",\"\"&F7)","v":"???????????????"}]
[{"$f":"IF('GL Template'!B22<>\"\",'GL Template'!B22,0)","v":0},{"$f":"IF('GL Template'!D22<>\"\",'GL Template'!D22,0)","v":0},"Error",null,null,null,null,null,null,null,null,null,null,{"$f":"IF(OR(LEFT('Web Links'!$C8,2)=\"In\",$C8=\"Error\"),\"?????\",\"\"&C8)","v":"?????"},{"$f":"IF(OR(LEFT('Web Links'!$C8,2)=\"In\",$C8=\"Error\"),\"??????????\",\"\"&D8)","v":"??????????"},{"$f":"IF(OR(LEFT('Web Links'!$C8,2)=\"In\",$C8=\"Error\"),\"???\",IF(LEN(E8)=2,\"0\",IF(LEN(E8)=1,\"00\",\"\")))&'Web Links'!E8","v":"???"},{"$f":"IF(OR(LEFT('Web Links'!$C8,2)=\"In\",$C8=\"Error\"),\"?????\",IF(LEN(G8)=4,\"\",IF(LEN(G8)=3,\"\",IF(LEN(G8)=2,\"\",IF(LEN(G8)=1,\"\",\"\"))))&'Web Links'!G8)","v":"?????"},{"$f":"IF(OR(LEFT('Web Links'!$C8,2)=\"In\",$C8=\"Error\"),\"???????????????\",\"\"&F8)","v":"???????????????"}]
[{"$f":"IF('GL Template'!B23<>\"\",'GL Template'!B23,0)","v":0},{"$f":"IF('GL Template'!D23<>\"\",'GL Template'!D23,0)","v":0},"Error",null,null,null,null,null,null,null,null,null,null,{"$f":"IF(OR(LEFT('Web Links'!$C9,2)=\"In\",$C9=\"Error\"),\"?????\",\"\"&C9)","v":"?????"},{"$f":"IF(OR(LEFT('Web Links'!$C9,2)=\"In\",$C9=\"Error\"),\"??????????\",\"\"&D9)","v":"??????????"},{"$f":"IF(OR(LEFT('Web Links'!$C9,2)=\"In\",$C9=\"Error\"),\"???\",IF(LEN(E9)=2,\"0\",IF(LEN(E9)=1,\"00\",\"\")))&'Web Links'!E9","v":"???"},{"$f":"IF(OR(LEFT('Web Links'!$C9,2)=\"In\",$C9=\"Error\"),\"?????\",IF(LEN(G9)=4,\"\",IF(LEN(G9)=3,\"\",IF(LEN(G9)=2,\"\",IF(LEN(G9)=1,\"\",\"\"))))&'Web Links'!G9)","v":"?????"},{"$f":"IF(OR(LEFT('Web Links'!$C9,2)=\"In\",$C9=\"Error\"),\"???????????????\",\"\"&F9)","v":"???????????????"}]
[{"$f":"IF('GL Template'!B24<>\"\",'GL Template'!B24,0)","v":0},{"$f":"IF('GL Template'!D24<>\"\",'GL Template'!D24,0)","v":0},"Error",null,null,null,null,null,null,null,null,null,null,{"$f":"IF(OR(LEFT('Web Links'!$C10,2)=\"In\",$C10=\"Error\"),\"?????\",\"\"&C10)","v":"?????"},{"$f":"IF(OR(LEFT('Web Links'!$C10,2)=\"In\",$C10=\"Error\"),\"??????????\",\"\"&D10)","v":"??????????"},{"$f":"IF(OR(LEFT('Web Links'!$C10,2)=\"In\",$C10=\"Error\"),\"???\",IF(LEN(E10)=2,\"0\",IF(LEN(E10)=1,\"00\",\"\")))&'Web Links'!E10","v":"???"},{"$f":"IF(OR(LEFT('Web Links'!$C10,2)=\"In\",$C10=\"Error\"),\"?????\",IF(LEN(G10)=4,\"\",IF(LEN(G10)=3,\"\",IF(LEN(G10)=2,\"\",IF(LEN(G10)=1,\"\",\"\"))))&'Web Links'!G10)","v":"?????"},{"$f":"IF(OR(LEFT('Web Links'!$C10,2)=\"In\",$C10=\"Error\"),\"???????????????\",\"\"&F10)","v":"???????????????"}]
[{"$f":"IF('GL Template'!B25<>\"\",'GL Template'!B25,0)","v":0},{"$f":"IF('GL Template'!D25<>\"\",'GL Template'!D25,0)","v":0},"Error",null,null,null,null,null,null,null,null,null,null,{"$f":"IF(OR(LEFT('Web Links'!$C11,2)=\"In\",$C11=\"Error\"),\"?????\",\"\"&C11)","v":"?????"},{"$f":"IF(OR(LEFT('Web Links'!$C11,2)=\"In\",$C11=\"Error\"),\"??????????\",\"\"&D11)","v":"??????????"},{"$f":"IF(OR(LEFT('Web Links'!$C11,2)=\"In\",$C11=\"Error\"),\"???\",IF(LEN(E11)=2,\"0\",IF(LEN(E11)=1,\"00\",\"\")))&'Web Links'!E11","v":"???"},{"$f":"IF(OR(LEFT('Web Links'!$C11,2)=\"In\",$C11=\"Error\"),\"?????\",IF(LEN(G11)=4,\"\",IF(LEN(G11)=3,\"\",IF(LEN(G11)=2,\"\",IF(LEN(G11)=1,\"\",\"\"))))&'Web Links'!G11)","v":"?????"},{"$f":"IF(OR(LEFT('Web Links'!$C11,2)=\"In\",$C11=\"Error\"),\"???????????????\",\"\"&F11)","v":"???????????????"}]
[{"$f":"IF('GL Template'!B26<>\"\",'GL Template'!B26,0)","v":0},{"$f":"IF('GL Template'!D26<>\"\",'GL Template'!D26,0)","v":0},"Error",null,null,null,null,null,null,null,null,null,null,{"$f":"IF(OR(LEFT('Web Links'!$C12,2)=\"In\",$C12=\"Error\"),\"?????\",\"\"&C12)","v":"?????"},{"$f":"IF(OR(LEFT('Web Links'!$C12,2)=\"In\",$C12=\"Error\"),\"??????????\",\"\"&D12)","v":"??????????"},{"$f":"IF(OR(LEFT('Web Links'!$C12,2)=\"In\",$C12=\"Error\"),\"???\",IF(LEN(E12)=2,\"0\",IF(LEN(E12)=1,\"00\",\"\")))&'Web Links'!E12","v":"???"},{"$f":"IF(OR(LEFT('Web Links'!$C12,2)=\"In\",$C12=\"Error\"),\"?????\",IF(LEN(G12)=4,\"\",IF(LEN(G12)=3,\"\",IF(LEN(G12)=2,\"\",IF(LEN(G12)=1,\"\",\"\"))))&'Web Links'!G12)","v":"?????"},{"$f":"IF(OR(LEFT('Web Links'!$C12,2)=\"In\",$C12=\"Error\"),\"???????????????\",\"\"&F12)","v":"???????????????"}]
[{"$f":"IF('GL Template'!B27<>\"\",'GL Template'!B27,0)","v":0},{"$f":"IF('GL Template'!D27<>\"\",'GL Template'!D27,0)","v":0},"Error",null,null,null,null,null,null,null,null,null,null,{"$f":"IF(OR(LEFT('Web Links'!$C13,2)=\"In\",$C13=\"Error\"),\"?????\",\"\"&C13)","v":"?????"},{"$f":"IF(OR(LEFT('Web Links'!$C13,2)=\"In\",$C13=\"Error\"),\"??????????\",\"\"&D13)","v":"??????????"},{"$f":"IF(OR(LEFT('Web Links'!$C13,2)=\"In\",$C13=\"Error\"),\"???\",IF(LEN(E13)=2,\"0\",IF(LEN(E13)=1,\"00\",\"\")))&'Web Links'!E13","v":"???"},{"$f":"IF(OR(LEFT('Web Links'!$C13,2)=\"In\",$C13=\"Error\"),\"?????\",IF(LEN(G13)=4,\"\",IF(LEN(G13)=3,\"\",IF(LEN(G13)=2,\"\",IF(LEN(G13)=1,\"\",\"\"))))&'Web Links'!G13)","v":"?????"},{"$f":"IF(OR(LEFT('Web Links'!$C13,2)=\"In\",$C13=\"Error\"),\"???????????????\",\"\"&F13)","v":"???????????????"}]
[{"$f":"IF('GL Template'!B28<>\"\",'GL Template'!B28,0)","v":0},{"$f":"IF('GL Template'!D28<>\"\",'GL Template'!D28,0)","v":0},"Error",null,null,null,null,null,null,null,null,null,null,{"$f":"IF(OR(LEFT('Web Links'!$C14,2)=\"In\",$C14=\"Error\"),\"?????\",\"\"&C14)","v":"?????"},{"$f":"IF(OR(LEFT('Web Links'!$C14,2)=\"In\",$C14=\"Error\"),\"??????????\",\"\"&D14)","v":"??????????"},{"$f":"IF(OR(LEFT('Web Links'!$C14,2)=\"In\",$C14=\"Error\"),\"???\",IF(LEN(E14)=2,\"0\",IF(LEN(E14)=1,\"00\",\"\")))&'Web Links'!E14","v":"???"},{"$f":"IF(OR(LEFT('Web Links'!$C14,2)=\"In\",$C14=\"Error\"),\"?????\",IF(LEN(G14)=4,\"\",IF(LEN(G14)=3,\"\",IF(LEN(G14)=2,\"\",IF(LEN(G14)=1,\"\",\"\"))))&'Web Links'!G14)","v":"?????"},{"$f":"IF(OR(LEFT('Web Links'!$C14,2)=\"In\",$C14=\"Error\"),\"???????????????\",\"\"&F14)","v":"???????????????"}]
[{"$f":"IF('GL Template'!B29<>\"\",'GL Template'!B29,0)","v":0},{"$f":"IF('GL Template'!D29<>\"\",'GL Template'!D29,0)","v":0},"Error",null,null,null,null,null,null,null,null,null,null,{"$f":"IF(OR(LEFT('Web Links'!$C15,2)=\"In\",$C15=\"Error\"),\"?????\",\"\"&C15)","v":"?????"},{"$f":"IF(OR(LEFT('Web Links'!$C15,2)=\"In\",$C15=\"Error\"),\"??????????\",\"\"&D15)","v":"??????????"},{"$f":"IF(OR(LEFT('Web Links'!$C15,2)=\"In\",$C15=\"Error\"),\"???\",IF(LEN(E15)=2,\"0\",IF(LEN(E15)=1,\"00\",\"\")))&'Web Links'!E15","v":"???"},{"$f":"IF(OR(LEFT('Web Links'!$C15,2)=\"In\",$C15=\"Error\"),\"?????\",IF(LEN(G15)=4,\"\",IF(LEN(G15)=3,\"\",IF(LEN(G15)=2,\"\",IF(LEN(G15)=1,\"\",\"\"))))&'Web Links'!G15)","v":"?????"},{"$f":"IF(OR(LEFT('Web Links'!$C15,2)=\"In\",$C15=\"Error\"),\"???????????????\",\"\"&F15)","v":"???????????????"}]
{"$rows_left_out":489}
{"sheet":"Drop Downs","index":4,"n_rows":25,"n_cols":34,"rows_kept":25,"cut":false,"hidden":true,"merged":[]}
[null,null,null,null,null,null,null,null,null,null,null,null,null,null,null,null,null,null,null,null,null,null,null,null,null,null,"UMAMH","UMass Amherst",null,"ACTUALS",null,"N - Do Not Generate Reversal",null,"GLE"]
[null,null,null,null,null,null,null,null,null,null,null,null,null,null,null,null,null,null,null,null,null,null,null,null,null,null,"UMBOS","UMass Boston",null,"ADJUST",null,"B - Beginning of Next Period",null,"GLC"]
[null,null,null,null,null,null,null,null,null,null,null,null,null,null,null,null,null,null,null,null,null,null,null,null,null,null,"UMCEN","UMass President's Office",null,null,null,"E - End of Next Period",null,"CGE"]
[null,null,null,null,null,null,null,null,null,null,null,null,null,null,null,null,null,null,null,null,null,null,null,null,null,null,"UMDAR","UMass Dartmouth",null,null,null,"D - Date Defined by User",null,"CGC"]
[null,null,null,null,null,null,null,null,null,null,null,null,null,null,null,null,null,null,null,null,null,null,null,null,null,null,"UMLOW","UMass Lowell"]
[null,null,null,null,null,null,null,null,null,null,null,null,null,null,null,null,null,null,null,null,null,null,null,null,null,null,"UMWOR","UMass Worcester"]
[null,null,null,null,null,null,null,null,null,null,null,null,null,null,null,null,null,null,null,null,null,null,null,null,null,null,"WCCCP","Worcester City Campus Corp"]
[null,null,null,null,null,null,null,null,null,null,null,null,null,null,null,null,null,null,null,null,null,null,null,null,null,null,"WUMMF","UMass Memorial Foundation"]
[null,null,null,null,null,null,null,null,null,null,null,null,null,null,null,null,null,null,null,null,null,null,null,null,null,null,"WCPSP","WCS Uhealth Solutions"]
[null,null,null,null,null,null,null,null,null,null,null,null,null,null,null,null,null,null,null,null,null,null,null,null,null,null,"WCS00","WCS Inc"]
[null,null,null,null,null,null,null,null,null,null,null,null,null,null,null,null,null,null,null,null,null,null,null,null,null,null,"WCS01","WCS - 222 Maple"]
[null,null,null,null,null,null,null,null,null,null,null,null,null,null,null,null,null,null,null,null,null,null,null,null,null,null,"WCS02","WCS - 460 Walk Hill"]
[null,null,null,null,null,null,null,null,null,null,null,null,null,null,null,null,null,null,null,null,null,null,null,null,null,null,"WCS03","WCS - 100 Century"]
[null,null,null,null,null,null,null,null,null,null,null,null,null,null,null,null,null,null,null,null,null,null,null,null,null,null,"WCS04","WCS - 3 Centennial"]
[null,null,null,null,null,null,null,null,null,null,null,null,null,null,null,null,null,null,null,null,null,null,null,null,null,null,"WCS05","WCS - 55 Lake Ave"]
{"$rows_left_out":11}
{"sheet":"SOAP","index":5,"n_rows":27,"n_cols":4,"rows_kept":27,"cut":false,"hidden":true,"merged":[[25,1,25,13],[26,1,26,13]]}
["Current Instance:","fsprd91"]
["Description:","Production"]
["Currnt URL:","https://fs-prd.erp.umasscs.net/PSIGW/PeopleSoftServiceListeningConnector/UM_SPEEDCHART_SRVC.1.wsdl"]
["Current Host:","https://fs-prd.erp.umasscs.net"]
["Current End Point:","https://fs-prd.erp.umasscs.net/PSIGW/PeopleSoftServiceListeningConnecto"]
[]
[null,"Instance","Description","Value"]
["URL:","fsdev91","Development","https://fs-dev.erp.umasscs.net/PSIGW/PeopleSoftServiceListeningConnector/UM_SPEEDCHART_SRVC.1.wsdl"]
[null,"fsltd91","Long Term Development"]
[null,"fstst91","Test","https://fs-tst.erp.umasscs.net/PSIGW/PeopleSoftServiceListeningConnector/UM_SPEEDCHART_SRVC.1.wsdl"]
[null,"fsltt91","Long Term Test"]
[null,"fsprd91","Production","https://fs-prd.erp.umasscs.net/PSIGW/PeopleSoftServiceListeningConnector/UM_SPEEDCHART_SRVC.1.wsdl"]
[]
["Host:","fsdev91","Development","https://fs-dev.erp.umasscs.net"]
[null,"fsltd91","Long Term Development"]
{"$rows_left_out":13}
{"sheet":"Change Log","index":6,"n_rows":26,"n_cols":6,"rows_kept":26,"cut":false,"hidden":true,"merged":[]}
["CSR","Date","Developer","Object Type","Object Name","Comments"]
["FS9-22565","2014-11-05","S Wood","Tab","Change Log","Added tab"]
[null,null,null,null,"SOAP","Added tab"]
[null,null,null,null,"Web Links","Added column labels"]
[]
[null,null,null,"VB","SOAP.Worksheet_Change","Logic to set Current IB information ofr Instance"]
[null,null,null,null,"GL Template.Workshhet_Change","Add call to RetrieveSpeedChartValues"]
[null,null,null,null,null,"Commented out call to XWalkUpdate"]
[null,null,null,null,"Module3.RefreshAll","Add call to RetrieveSpeedChartValues"]
[null,null,null,null,null,"Commented out call to XWalkUpdate"]
[null,null,null,null,"Module2","Added Function RetrieveSpeedChartValues"]
[null,null,null,null,null,"Added Function GetTagValue"]
[]
[null,null,null,"Name","IB_URL","Range of SOAP URL Instances"]
[null,null,null,null,"IB_HOST","Range of SOAP HOST Instances"]
{"$rows_left_out":11}