{"text_format":"1","workbook":"xlsx","n_sheets":15,"sheets":["Instructions","Sample_Plan Computer Science","Sample_Checklist","Sample_Plan_Data_Science","Sample_Checklist_Data Science","Sample_Plan Bio-cheminformatics","Sample_Checklist Bio-cheminform","Graduation_Plan","Checklist","Graduation_Plan-General","Checklist_General","Graduation_Plan-Data-Science","Checklist_Data Science","Graduation_Plan-Biocheminfo","Checklist Bio-cheminformatics"],"not_rendered":{"charts":0,"images":0,"macros":1,"external_links":0,"defined_names":0,"comments":14,"pivot_tables":0},"unopened":[],"bounds":{"document_bytes":16777216,"sheet_cells":100000,"rows_first":2000,"rows_last":500,"rows_between":2000,"halvings":0,"cell_chars":16384,"cell_head_chars":4096},"cells_cut":0,"cells_raw":0,"read":"whole","date_system":"1900"}

{"sheet":"Instructions","index":0,"n_rows":0,"n_cols":0,"rows_kept":0,"cut":false,"hidden":false,"merged":[]}

{"sheet":"Sample_Plan Computer Science","index":1,"n_rows":399,"n_cols":8,"rows_kept":399,"cut":false,"hidden":true,"merged":[[223,2,223,5],[238,2,238,5],[246,2,246,5],[237,0,237,6],[296,2,296,5],[288,2,288,5],[260,0,260,6],[271,0,271,6],[287,0,287,6],[261,2,261,5],[272,0,272,5],[273,2,273,5],[138,2,138,5],[146,2,146,5],[161,2,161,5],[211,2,211,5],[222,0,222,5],[160,0,160,6],[171,0,171,6],[187,0,187,6],[210,0,210,6],[221,0,221,6],[172,0,172,5],[173,2,173,5],[188,2,188,5],[196,2,196,5],[391,1,392,3],[391,4,392,4],[393,1,393,3],[398,1,398,4],[399,1,399,4],[389,1,389,3],[375,1,376,3],[375,4,376,4],[377,1,377,3],[379,1,380,3],[379,4,380,4],[381,1,381,3],[383,1,384,3],[383,4,384,4],[385,1,385,3],[387,1,388,3],[387,4,388,4],[373,1,373,4],[310,0,310,6],[321,0,321,6],[337,0,337,6],[360,0,360,6],[371,0,371,6],[346,3,346,5],[361,2,361,5],[311,2,311,5],[322,0,322,5],[323,2,323,5],[338,2,338,5],[87,0,87,6],[110,0,110,6],[121,0,121,6],[137,0,137,6],[73,2,73,5],[88,2,88,5],[96,2,96,5],[111,2,111,5],[122,0,122,5],[123,2,123,5],[72,0,72,5],[10,0,10,6],[11,0,11,3],[11,4,11,5],[12,0,12,3],[12,4,12,5],[13,0,13,6],[14,0,14,3],[15,0,15,6],[16,0,16,5],[71,0,71,6],[17,0,17,5],[7,0,7,1],[7,2,7,5],[8,0,8,1],[8,2,8,5],[9,0,9,1],[9,2,9,5],[4,0,4,1],[4,2,4,5],[5,0,5,1],[5,2,5,5],[6,0,6,1],[6,2,6,5],[3,0,3,1],[3,2,3,5],[0,0,0,5],[1,0,1,1],[1,2,1,5],[2,0,2,1],[2,2,2,5]]}
["Computer Science Graduation Plan"]
["Student Name",null,"Last Name, First Name"]
["University Id (not ss#)"]
["Email"]
["Primary Major (Option)",null,"Computer Science (General Option)"]
["Second Major:"]
["Third Major:"]
["Minors(s):"]
["Special Program(s):"]
["Scholarships:"]
[]
["Matriculation Date (Month/Year)",null,null,null,"Sept. 2016"]
["Expected Graduation Date (Month/Year)",null,null,null,"June 2020"]
[]
["Minimum Number of Credits Required for Degree(s)",null,null,null,120]
[]
["Transfer and AP Credits"]
[]
["Course","Req.","Req.","Course Title","Credits","Grade","Degree Credits","SemesterYear"]
[null,null,null,"AP: Physics C - Mechanics",0,2,null,"Transfer/AP"]
["ECON.2010","SS-1",null,"AP: Microeconomics",3,4,null,"Transfer/AP"]
["ENGL.1010","CW-1",null,"English Literature & Composition",3,"A-",null,"Transfer/AP"]
[null,null,null,null,null,null,null,"Transfer/AP"]
[null,null,null,null,null,null,null,"Transfer/AP"]
[null,null,null,null,null,null,null,"Transfer/AP"]
[null,null,null,null,null,null,null,"Transfer/AP"]
[null,null,null,null,null,null,null,"Transfer/AP"]
[null,null,null,null,null,null,null,"Transfer/AP"]
[null,null,null,null,null,null,null,"Transfer/AP"]
[null,null,null,null,null,null,null,"Transfer/AP"]
[null,null,null,null,null,null,null,"Transfer/AP"]
[null,null,null,null,null,null,null,"Transfer/AP"]
[null,null,null,null,null,null,null,"Transfer/AP"]
[null,null,null,null,null,null,null,"Transfer/AP"]
[null,null,null,null,null,null,null,"Transfer/AP"]
[null,null,null,null,null,null,null,"Transfer/AP"]
[null,null,null,null,null,null,null,"Transfer/AP"]
[null,null,null,null,null,null,null,"Transfer/AP"]
[null,null,null,null,null,null,null,"Transfer/AP"]
[null,null,null,null,null,null,null,"Transfer/AP"]
[null,null,null,null,null,null,null,"Transfer/AP"]
[null,null,null,null,null,null,null,"Transfer/AP"]
[null,null,null,null,null,null,null,"Transfer/AP"]
[null,null,null,null,null,null,null,"Transfer/AP"]
[null,null,null,null,null,null,null,"Transfer/AP"]
[null,null,null,null,null,null,null,"Transfer/AP"]
[null,null,null,null,null,null,null,"Transfer/AP"]
[null,null,null,null,null,null,null,"Transfer/AP"]
[null,null,null,null,null,null,null,"Transfer/AP"]
[null,null,null,null,null,null,null,"Transfer/AP"]
[null,null,null,null,null,null,null,"Transfer/AP"]
[null,null,null,null,null,null,null,"Transfer/AP"]
[null,null,null,null,null,null,null,"Transfer/AP"]
[null,null,null,null,null,null,null,"Transfer/AP"]
[null,null,null,null,null,null,null,"Transfer/AP"]
[null,null,null,null,null,null,null,"Transfer/AP"]
[null,null,null,null,null,null,null,"Transfer/AP"]
[null,null,null,null,null,null,null,"Transfer/AP"]
[null,null,null,null,null,null,null,"Transfer/AP"]
[null,null,null,null,null,null,null,"Transfer/AP"]
[null,null,null,null,null,null,null,"Transfer/AP"]
[null,null,null,null,null,null,null,"Transfer/AP"]
[null,null,null,null,null,null,null,"Transfer/AP"]
[null,null,null,null,null,null,null,"Transfer/AP"]
[null,null,null,null,null,null,null,"Transfer/AP"]
[null,null,null,null,null,null,null,"Transfer/AP"]
[null,null,null,null,null,null,null,"Transfer/AP"]
[null,null,null,null,null,null,null,"Transfer/AP"]
[null,null,null,null,null,null,null,"Transfer/AP"]
[" "," ",null,"Transfer and AP Credits",{"$f":"SUM(E20:E69)","v":6},null,{"$f":"SUM(G20:G69)","v":0}]
[" "," ",null,"Total Credits Earned",{"$f":"E70","v":6},null,{"$f":"E15-G70","v":120}]
[]
["Year 1"]
["Fall","2016",{"$f":"C2","v":"Last Name, First Name"}]
["Course",{"$f":"B19","v":"Req."},{"$f":"C19","v":"Req."},"Course Title","Credits","Grade","Degree Credits","SemesterYear"]
["COMP.1010",null,null,"Computing I",3,null,null,{"$f":"$A$74&$B$74","v":"Fall2016"}]
["COMP.1030L",null,null,"Computing I Lab",1,null,null,{"$f":"$A$74&$B$74","v":"Fall2016"}]
["MATH.1310","MA",null,"Calculus I",4,null,null,"Fall2016"]
["ENGL.1020","CW-2",null,"College Writing II",3,null,null,"Fall2016"]
["SOCI.2320","SS-2,DV",null,"Social Psychology",3,null,null,"Fall2016"]
[null,null,null,null,null,null,null,"Fall2016"]
[null,null,null,null,null,null,null,"Fall2016"]
[null,null,null,null,null,null,null,"Fall2016"]
[null,null,null,null,null,null,null,"Fall2016"]
[null,null,null,null,null,null,null,"Fall2016"]
[" "," ",null,"Semester Credits Earned",{"$f":"SUM(E76:E85)","v":14},null,{"$f":"SUM(G76:G85)","v":0}]
[" "," ",null,{"$f":"D71","v":"Total Credits Earned"},{"$f":"E71+E86","v":20},null,{"$f":"G71-G86","v":120}]
[]
["Winter",{"$f":"B74+1","v":2017},{"$f":"C2","v":"Last Name, First Name"}]
["Course",{"$f":"B19","v":"Req."},null,"Course Title","Credits","Grade","Degree Credits","SemesterYear"]
[null,null,null,null,null,null,null,{"$f":"$A$89&$B$89","v":"Winter2017"}]
[null,null,null,null,null,null,null,{"$f":"$A$89&$B$89","v":"Winter2017"}]
[null,null,null,null,null,null,null,"Winter2017"]
[" "," ",null,{"$f":"D86","v":"Semester Credits Earned"},{"$f":"SUM(E91:E93)","v":0},null,{"$f":"SUM(G91:G93)","v":0}]
[" "," ",null,{"$f":"D71","v":"Total Credits Earned"},{"$f":"E87+E94","v":20},null,{"$f":"G87-G94","v":120}]
[]
["Spring",{"$f":"B74+1","v":2017},{"$f":"C2","v":"Last Name, First Name"}]
["Course",{"$f":"B19","v":"Req."},{"$f":"C19","v":"Req."},"Course Title","Credits","Grade","Degree Credits","SemesterYear"]
["COMP.1020",null,null,"Computing II",3,null,null,{"$f":"$A$97&$B$97","v":"Spring2017"}]
["COMP.1040L",null,null,"Computer II Lab",1,null,null,{"$f":"$A$97&$B$97","v":"Spring2017"}]
["MATH.1320",null,null,"Calculus II",4,null,null,"Spring2017"]
["NS-1","SC-1","NS-1","Natural Science Lecture",3,null,null,"Spring2017"]
["NS-Lab1","SCL-1","NS-Lab1","Natural Science Lab",1,null,null,"Spring2017"]
["AH-1","AH-1",null,"Breadth of Knowledge Requirement",3,null,null,"Spring2017"]
[null,null,null,null,null,null,null,"Spring2017"]
[null,null,null,null,null,null,null,"Spring2017"]
[null,null,null,null,null,null,null,"Spring2017"]
[null,null,null,null,null,null,null,"Spring2017"]
[" "," ",null,{"$f":"D86","v":"Semester Credits Earned"},{"$f":"SUM(E99:E108)","v":15},null,{"$f":"SUM(G99:G108)","v":0}]
[" "," ",null,{"$f":"D71","v":"Total Credits Earned"},{"$f":"E95+E109","v":35},null,{"$f":"G95-G109","v":120}]
[]
["Summer",{"$f":"B74+1","v":2017},{"$f":"C2","v":"Last Name, First Name"}]
["Course",{"$f":"B19","v":"Req."},{"$f":"C19","v":"Req."},"Course Title","Credits","Grade","Degree Credits","SemesterYear"]
[null,null,null,null,null,null,null,{"$f":"$A$112&$B$112","v":"Summer2017"}]
[null,null,null,null,null,null,null,{"$f":"$A$112&$B$112","v":"Summer2017"}]
[null,null,null,null,null,null,null,"Summer2017"]
[null,null,null,null,null,null,null,"Summer2017"]
[null,null,null,null,null,null,null,"Summer2017"]
[null,null,null,null,null,null,null,"Summer2017"]
[" "," ",null,{"$f":"D86","v":"Semester Credits Earned"},{"$f":"SUM(E114:E119)","v":0},null,{"$f":"SUM(G114:G119)","v":0}]
[" "," ",null,{"$f":"D71","v":"Total Credits Earned"},{"$f":"E110+E120","v":35},null,{"$f":"G110-G120","v":120}]
[]
["Year 2"]
["Fall",{"$f":"B74+1","v":2017},{"$f":"C2","v":"Last Name, First Name"}]
["Course",{"$f":"B19","v":"Req."},{"$f":"C19","v":"Req."},"Course Title","Credits","Grade","Degree Credits","SemesterYear"]
["COMP.2010",null,null,"Computing III",3,null,null,{"$f":"$A$124&$B$124","v":"Fall2017"}]
["COMP.2010L",null,null,"Computing III Lab",1,null,null,{"$f":"$A$124&$B$124","v":"Fall2017"}]
["COMP.2030",null,null,"Assembly Language Programming",3,null,null,"Fall2017"]
["COMP.2030L",null,null,"Assembly Language Programming Lab",1,null,null,"Fall2017"]
["MATH.3210",null,null,"Discrete Structures I",3,null,null,"Fall2017"]
["EECE.2650",null,null,"Logic Design",3,null,null,"Fall2017"]
[null,null,null,null,null,null,null,"Fall2017"]
[null,null,null,null,null,null,null,"Fall2017"]
[null,null,null,null,null,null,null,"Fall2017"]
[null,null,null,null,null,null,null,"Fall2017"]
[" "," ",null,{"$f":"D86","v":"Semester Credits Earned"},{"$f":"SUM(E126:E135)","v":14},null,{"$f":"SUM(G126:G135)","v":0}]
[" "," ",null,{"$f":"D71","v":"Total Credits Earned"},{"$f":"E121+E136","v":49},null,{"$f":"G121-G136","v":120}]
[]
["Winter",{"$f":"B74+2","v":2018},{"$f":"C2","v":"Last Name, First Name"}]
["Course",{"$f":"B19","v":"Req."},{"$f":"C19","v":"Req."},"Course Title","Credits","Grade","Degree Credits","SemesterYear"]
[null,null,null,null,null,null,null,{"$f":"$A$139&$B$139","v":"Winter2018"}]
[null,null,null,null,null,null,null,{"$f":"$A$139&$B$139","v":"Winter2018"}]
[null,null,null,null,null,null,null,"Winter2018"]
[" "," ",null,{"$f":"D86","v":"Semester Credits Earned"},{"$f":"SUM(E141:E143)","v":0},null,{"$f":"SUM(G141:G143)","v":0}]
[" "," ",null,{"$f":"D71","v":"Total Credits Earned"},{"$f":"E137+E144","v":49},null,{"$f":"G137-G144","v":120}]
[]
["Spring",{"$f":"B89+1","v":2018},{"$f":"C2","v":"Last Name, First Name"}]
["Course",{"$f":"B19","v":"Req."},{"$f":"C19","v":"Req."},"Course Title","Credits","Grade","Degree Credits","SemesterYear"]
["COMP.2040",null,null,"Computing IV",3,null,null,{"$f":"$A$147&$B$147","v":"Spring2018"}]
["MATH.3220",null,null,"Discrete Structures II",3,null,null,{"$f":"$A$147&$B$147","v":"Spring2018"}]
["MATH.3860",null,null,"Probability and Statistics I",3,null,null,"Spring2018"]
["AH-2","AH-2,ET","CSET","Breadth of Knowledge Requirement",3,null,null,"Spring2018"]
["FE-1","FE-1",null,"Free Elective",3,null,null,"Spring2018"]
[null,null,null,null,null,null,null,"Spring2018"]
[null,null,null,null,null,null,null,"Spring2018"]
[null,null,null,null,null,null,null,"Spring2018"]
[null,null,null,null,null,null,null,"Spring2018"]
[null,null,null,null,null,null,null,"Spring2018"]
[" "," ",null,{"$f":"D86","v":"Semester Credits Earned"},{"$f":"SUM(E149:E158)","v":15},null,{"$f":"SUM(G149:G158)","v":0}]
[" "," ",null,{"$f":"D71","v":"Total Credits Earned"},{"$f":"E145+E159","v":64},null,{"$f":"G145-G159","v":120}]
[]
["Summer",{"$f":"B74+2","v":2018},{"$f":"C2","v":"Last Name, First Name"}]
["Course",{"$f":"B19","v":"Req."},{"$f":"C19","v":"Req."},"Course Title","Credits","Grade","Degree Credits","SemesterYear"]
[null,null,null,null,null,null,null,{"$f":"$A$162&$B$162","v":"Summer2018"}]
[null,null,null,null,null,null,null,{"$f":"$A$162&$B$162","v":"Summer2018"}]
[null,null,null,null,null,null,null,"Summer2018"]
[null,null,null,null,null,null,null,"Summer2018"]
[null,null,null,null,null,null,null,"Summer2018"]
[null,null,null,null,null,null,null,"Summer2018"]
[" "," ",null,{"$f":"D86","v":"Semester Credits Earned"},{"$f":"SUM(E164:E169)","v":0},null,{"$f":"SUM(G163:G169)","v":0}]
[" "," ",null,{"$f":"D71","v":"Total Credits Earned"},{"$f":"E160+E170","v":64},null,{"$f":"G160-G170","v":120}]
[]
["Year 3"]
["Fall",{"$f":"B74+2","v":2018},{"$f":"C2","v":"Last Name, First Name"}]
["Course",{"$f":"B19","v":"Req."},{"$f":"C19","v":"Req."},"Course Title","Credits","Grade","Degree Credits","SemesterYear"]
["COMP.3040",null,null,"Foundations of Computer Science",3,null,null,{"$f":"$A$174&$B$174","v":"Fall2018"}]
["COMP.3050",null,null,"Computer Architecture",3,null,null,{"$f":"$A$174&$B$174","v":"Fall2018"}]
["NS-2","SC-2","NS-2","Natural Science Lecture",3,null,null,"Fall2018"]
["NS-Lab2","SCL-2","NS-Lab2","Natural Science Lab",1,null,null,"Fall2018"]
["FE-2","FE-2,DV",null,"Free Elective",3,null,null,"Fall2018"]
[null,null,null,null,null,null,null,"Fall2018"]
[null,null,null,null,null,null,null,"Fall2018"]
[null,null,null,null,null,null,null,"Fall2018"]
[null,null,null,null,null,null,null,"Fall2018"]
[null,null,null,null,null,null,null,"Fall2018"]
[" "," ",null,{"$f":"D86","v":"Semester Credits Earned"},{"$f":"SUM(E176:E185)","v":13},null,{"$f":"SUM(G176:G185)","v":0}]
[" "," ",null,{"$f":"D71","v":"Total Credits Earned"},{"$f":"E171+E186","v":77},null,{"$f":"G171-G186","v":120}]
[]
["Winter",{"$f":"B74+3","v":2019},{"$f":"C2","v":"Last Name, First Name"}]
["Course",{"$f":"B19","v":"Req."},{"$f":"C19","v":"Req."},"Course Title","Credits","Grade","Degree Credits","SemesterYear"]
[null,null,null,null,null,null,null,{"$f":"$A$189&$B$189","v":"Winter2019"}]
[null,null,null,null,null,null,null,{"$f":"$A$189&$B$189","v":"Winter2019"}]
[null,null,null,null,null,null,null,"Winter2019"]
[" "," ",null,{"$f":"D86","v":"Semester Credits Earned"},{"$f":"SUM(E191:E193)","v":0},null,{"$f":"SUM(G191:G193)","v":0},{"$f":"SUM(H191:H193)","v":0}]
[" "," ",null,{"$f":"D71","v":"Total Credits Earned"},{"$f":"E187+E194","v":77},null,{"$f":"G187-G194","v":120}]
[]
["Spring",{"$f":"B74+3","v":2019},{"$f":"C2","v":"Last Name, First Name"}]
["Course",{"$f":"B19","v":"Req."},{"$f":"C19","v":"Req."},"Course Title","Credits","Grade","Degree Credits","SemesterYear"]
["COMP.3010",null,null,"Organization of Programming Languages",3,null,null,{"$f":"$A$197&$B$197","v":"Spring2019"}]
["COMP.3080",null,null,"Introduction to Operating Systems",3,null,null,{"$f":"$A$197&$B$197","v":"Spring2019"}]
["NS-3","STEM","NS-3","Natural Science Lecture",3,null,null,"Spring2019"]
["NS-Lab3",null,"NS-Lab3","Natural Science Lab",1,null,null,"Spring2019"]
["ENGL.2200","AH-3",null,"Oral & Written Communication for CS",3,null,null,"Spring2019"]
["FE-3","FE-3",null,"Free Elective",3,null,null,"Spring2019"]
[null,null,null,null,null,null,null,"Spring2019"]
[null,null,null,null,null,null,null,"Spring2019"]
[null,null,null,null,null,null,null,"Spring2019"]
[null,null,null,null,null,null,null,"Spring2019"]
[" "," ",null,{"$f":"D86","v":"Semester Credits Earned"},{"$f":"SUM(E199:E208)","v":16},null,{"$f":"SUM(G199:G208)","v":0}]
[" "," ",null,{"$f":"D71","v":"Total Credits Earned"},{"$f":"E195+E209","v":93},null,{"$f":"G195-G209","v":120}]
[]
["Summer",{"$f":"B74+3","v":2019},{"$f":"C2","v":"Last Name, First Name"}]
["Course",{"$f":"B19","v":"Req."},{"$f":"C19","v":"Req."},"Course Title","Credits","Grade","Degree Credits","SemesterYear"]
[null,null,null,null,null,null,null,{"$f":"$A$212&$B$212","v":"Summer2019"}]
[null,null,null,null,null,null,null,{"$f":"$A$212&$B$212","v":"Summer2019"}]
[null,null,null,null,null,null,null,"Summer2019"]
[null,null,null,null,null,null,null,"Summer2019"]
[null,null,null,null,null,null,null,"Summer2019"]
[null,null,null,null,null,null,null,"Summer2019"]
[" "," ",null,{"$f":"D86","v":"Semester Credits Earned"},{"$f":"SUM(E214:E219)","v":0},null,{"$f":"SUM(G213:G219)","v":0}]
[" "," ",null,{"$f":"D71","v":"Total Credits Earned"},{"$f":"E210+E220","v":93},null,{"$f":"G210-G220","v":120}]
[]
["Year 4"]
["Fall",{"$f":"B74+3","v":2019},{"$f":"C2","v":"Last Name, First Name"}]
["Course",{"$f":"B19","v":"Req."},{"$f":"C19","v":"Req."},"Course Title","Credits","Grade","Degree Credits","SemesterYear"]
["COMP.4040",null,null,"Analysis of Algorithms",3,null,null,{"$f":"$A$224&$B$224","v":"Fall2019"}]
["COMP.4xxx-p1","Sr.Prj-1",null,"Project Course - part 1",3,null,null,{"$f":"$A$224&$B$224","v":"Fall2019"}]
["COMP.3/4xxx-1","CSE-1",null,"Computer Science Upper-level Elective",3,null,null,"Fall2019"]
["TechElec-1","TE-1",null,"Technical Elective",3,null,null,"Fall2019"]
["FE-4","FE-4",null,"Free Elective",3,null,null,"Fall2019"]
[null,null,null,null,null,null,null,"Fall2019"]
[null,null,null,null,null,null,null,"Fall2019"]
[null,null,null,null,null,null,null,"Fall2019"]
[null,null,null,null,null,null,null,"Fall2019"]
[null,null,null,null,null,null,null,"Fall2019"]
[" "," ",null,{"$f":"D86","v":"Semester Credits Earned"},{"$f":"SUM(E226:E235)","v":15},null,{"$f":"SUM(G226:G235)","v":0}]
[" "," ",null,{"$f":"D71","v":"Total Credits Earned"},{"$f":"E221+E236","v":108},null,{"$f":"G221-G236","v":120}]
[]
["Winter",{"$f":"B74+4","v":2020},{"$f":"C2","v":"Last Name, First Name"}]
["Course",{"$f":"B19","v":"Req."},{"$f":"C19","v":"Req."},"Course Title","Credits","Grade","Degree Credits","SemesterYear"]
[null,null,null,null,null,null,null,{"$f":"$A$239&$B$239","v":"Winter2020"}]
[null,null,null,null,null,null,null,{"$f":"$A$239&$B$239","v":"Winter2020"}]
[null,null,null,null,null,null,null,"Winter2020"]
[" "," ",null,{"$f":"D86","v":"Semester Credits Earned"},{"$f":"SUM(E241:E243)","v":0},null,{"$f":"SUM(G241:G243)","v":0}]
[" "," ",null,{"$f":"D71","v":"Total Credits Earned"},{"$f":"E237+E244","v":108},null,{"$f":"G237-G244","v":120}]
[]
["Spring",{"$f":"B74+4","v":2020},{"$f":"C2","v":"Last Name, First Name"}]
["Course",{"$f":"B19","v":"Req."},{"$f":"C19","v":"Req."},"Course Title","Credits","Grade","Degree Credits","SemesterYear"]
["COMP.4xxx-p2","Sr.Prj-2",null,"Project Course - part 2",3,null,null,{"$f":"$A$247&$B$247","v":"Spring2020"}]
["COMP.3/4xxx-2","CSE-2",null,"Computer Science Upper-level Elective",3,null,null,{"$f":"$A$247&$B$247","v":"Spring2020"}]
["TechElec-2","TE-2",null,"Technical Elective",3,null,null,"Spring2020"]
["SS-3","SS-3",null,"Breadth of Knowledge Requirement",3,null,null,"Spring2020"]
[null,null,null,null,null,null,null,"Spring2020"]
[null,null,null,null,null,null,null,"Spring2020"]
[null,null,null,null,null,null,null,"Spring2020"]
[null,null,null,null,null,null,null,"Spring2020"]
[null,null,null,null,null,null,null,"Spring2020"]
[null,null,null,null,null,null,null,"Spring2020"]
[" "," ",null,{"$f":"D86","v":"Semester Credits Earned"},{"$f":"SUM(E249:E258)","v":12},null,{"$f":"SUM(G249:G258)","v":0}]
[" "," ",null,{"$f":"D71","v":"Total Credits Earned"},{"$f":"E245+E259","v":120},null,{"$f":"G245-G259","v":120}]
[]
["Summer",{"$f":"B74+4","v":2020},{"$f":"C2","v":"Last Name, First Name"}]
["Course",{"$f":"B19","v":"Req."},{"$f":"C19","v":"Req."},"Course Title","Credits","Grade","Degree Credits","SemesterYear"]
[null,null,null,null,null,null,null,{"$f":"$A$262&$B$262","v":"Summer2020"}]
[null,null,null,null,null,null,null,{"$f":"$A$262&$B$262","v":"Summer2020"}]
[null,null,null,null,null,null,null,"Summer2020"]
[null,null,null,null,null,null,null,"Summer2020"]
[null,null,null,null,null,null,null,"Summer2020"]
[null,null,null,null,null,null,null,"Summer2020"]
[" "," ",null,{"$f":"D86","v":"Semester Credits Earned"},{"$f":"SUM(E264:E269)","v":0},null,{"$f":"SUM(G263:G269)","v":0}]
[" "," ",null,{"$f":"D71","v":"Total Credits Earned"},{"$f":"E260+E270","v":120},null,{"$f":"G260-G270","v":120}]
[]
["Year 5"]
["Fall",{"$f":"B74+4","v":2020},{"$f":"C2","v":"Last Name, First Name"}]
["Course",{"$f":"B19","v":"Req."},{"$f":"C19","v":"Req."},"Course Title","Credits","Grade","Degree Credits","SemesterYear"]
[null,null,null,null,null,null,null,{"$f":"$A$274&$B$274","v":"Fall2020"}]
[null,null,null,null,null,null,null,{"$f":"$A$274&$B$274","v":"Fall2020"}]
[null,null,null,null,null,null,null,"Fall2020"]
[null,null,null,null,null,null,null,"Fall2020"]
[null,null,null,null,null,null,null,"Fall2020"]
[null,null,null,null,null,null,null,"Fall2020"]
[null,null,null,null,null,null,null,"Fall2020"]
[null,null,null,null,null,null,null,"Fall2020"]
[null,null,null,null,null,null,null,"Fall2020"]
[null,null,null,null,null,null,null,"Fall2020"]
[" "," ",null,{"$f":"D86","v":"Semester Credits Earned"},{"$f":"SUM(E276:E285)","v":0},null,{"$f":"SUM(G276:G285)","v":0}]
[" "," ",null,{"$f":"D71","v":"Total Credits Earned"},{"$f":"E271+E286","v":120},null,{"$f":"G271-G286","v":120}]
[]
["Winter",{"$f":"B74+5","v":2021},{"$f":"C2","v":"Last Name, First Name"}]
["Course",{"$f":"B19","v":"Req."},{"$f":"C19","v":"Req."},"Course Title","Credits","Grade","Degree Credits","SemesterYear"]
[null,null,null,null,null,null,null,{"$f":"$A$289&$B$289","v":"Winter2021"}]
[null,null,null,null,null,null,null,{"$f":"$A$289&$B$289","v":"Winter2021"}]
[null,null,null,null,null,null,null,"Winter2021"]
[" "," ",null,{"$f":"D86","v":"Semester Credits Earned"},{"$f":"SUM(E291:E293)","v":0},null,{"$f":"SUM(G291:G293)","v":0}]
[" "," ",null,{"$f":"D71","v":"Total Credits Earned"},{"$f":"E287+E294","v":120},null,{"$f":"G287-G294","v":120}]
[]
["Spring",{"$f":"B74+5","v":2021},{"$f":"C2","v":"Last Name, First Name"}]
["Course",{"$f":"B19","v":"Req."},{"$f":"C19","v":"Req."},"Course Title","Credits","Grade","Degree Credits","SemesterYear"]
[null,null,null,null,null,null,null,{"$f":"$A$297&$B$297","v":"Spring2021"}]
[null,null,null,null,null,null,null,{"$f":"$A$297&$B$297","v":"Spring2021"}]
[null,null,null,null,null,null,null,"Spring2021"]
[null,null,null,null,null,null,null,"Spring2021"]
[null,null,null,null,null,null,null,"Spring2021"]
[null,null,null,null,null,null,null,"Spring2021"]
[null,null,null,null,null,null,null,"Spring2021"]
[null,null,null,null,null,null,null,"Spring2021"]
[null,null,null,null,null,null,null,"Spring2021"]
[null,null,null,null,null,null,null,"Spring2021"]
[" "," ",null,{"$f":"D86","v":"Semester Credits Earned"},{"$f":"SUM(E299:E308)","v":0},null,{"$f":"SUM(G299:G308)","v":0}]
[" "," ",null,{"$f":"D71","v":"Total Credits Earned"},{"$f":"E295+E309","v":120},null,{"$f":"G295-G309","v":120}]
[]
["Summer",{"$f":"B74+5","v":2021},{"$f":"C2","v":"Last Name, First Name"}]
["Course",{"$f":"B19","v":"Req."},{"$f":"C19","v":"Req."},"Course Title","Credits","Grade","Degree Credits","SemesterYear"]
[null,null,null,null,null,null,null,{"$f":"$A$312&$B$312","v":"Summer2021"}]
[null,null,null,null,null,null,null,{"$f":"$A$312&$B$312","v":"Summer2021"}]
[null,null,null,null,null,null,null,"Summer2021"]
[null,null,null,null,null,null,null,"Summer2021"]
[null,null,null,null,null,null,null,"Summer2021"]
[null,null,null,null,null,null,null,"Summer2021"]
[" "," ",null,{"$f":"D86","v":"Semester Credits Earned"},{"$f":"SUM(E314:E319)","v":0},null,{"$f":"SUM(G313:G319)","v":0}]
[" "," ",null,{"$f":"D71","v":"Total Credits Earned"},{"$f":"E310+E320","v":120},null,{"$f":"G310-G320","v":120}]
[]
["Year 6"]
["Fall",{"$f":"B74+5","v":2021},{"$f":"C2","v":"Last Name, First Name"}]
["Course",{"$f":"B19","v":"Req."},{"$f":"C19","v":"Req."},"Course Title","Credits","Grade","Degree Credits","SemesterYear"]
[null,null,null,null,null,null,null,{"$f":"$A$324&$B$324","v":"Fall2021"}]
[null,null,null,null,null,null,null,{"$f":"$A$324&$B$324","v":"Fall2021"}]
[null,null,null,null,null,null,null,"Fall2021"]
[null,null,null,null,null,null,null,"Fall2021"]
[null,null,null,null,null,null,null,"Fall2021"]
[null,null,null,null,null,null,null,"Fall2021"]
[null,null,null,null,null,null,null,"Fall2021"]
[null,null,null,null,null,null,null,"Fall2021"]
[null,null,null,null,null,null,null,"Fall2021"]
[null,null,null,null,null,null,null,"Fall2021"]
[" "," ",null,{"$f":"D136","v":"Semester Credits Earned"},{"$f":"SUM(E326:E335)","v":0},null,{"$f":"SUM(G326:G335)","v":0}]
[" "," ",null,{"$f":"D121","v":"Total Credits Earned"},{"$f":"E321+E336","v":120},null,{"$f":"G321-G336","v":120}]
[]
["Winter",{"$f":"B74+6","v":2022},{"$f":"C2","v":"Last Name, First Name"}]
["Course",{"$f":"B19","v":"Req."},{"$f":"C19","v":"Req."},"Course Title","Credits","Grade","Degree Credits","SemesterYear"]
[null,null,null,null,null,null,null,{"$f":"$A$339&$B$339","v":"Winter2022"}]
[null,null,null,null,null,null,null,{"$f":"$A$339&$B$339","v":"Winter2022"}]
[null,null,null,null,null,null,null,"Winter2022"]
[" "," ",null,{"$f":"D136","v":"Semester Credits Earned"},{"$f":"SUM(E341:E343)","v":0},null,{"$f":"SUM(G341:G343)","v":0}]
[" "," ",null,{"$f":"D121","v":"Total Credits Earned"},{"$f":"E337+E344","v":120},null,{"$f":"G337-G344","v":120}]
[]
["Spring",{"$f":"B74+6","v":2022},{"$f":"C2","v":"Last Name, First Name"}]
["Course",{"$f":"B19","v":"Req."},{"$f":"C19","v":"Req."},"Course Title","Credits","Grade","Degree Credits","SemesterYear"]
[null,null,null,null,null,null,null,{"$f":"$A$347&$B$347","v":"Spring2022"}]
[null,null,null,null,null,null,null,{"$f":"$A$347&$B$347","v":"Spring2022"}]
[null,null,null,null,null,null,null,"Spring2022"]
[null,null,null,null,null,null,null,"Spring2022"]
[null,null,null,null,null,null,null,"Spring2022"]
[null,null,null,null,null,null,null,"Spring2022"]
[null,null,null,null,null,null,null,"Spring2022"]
[null,null,null,null,null,null,null,"Spring2022"]
[null,null,null,null,null,null,null,"Spring2022"]
[null,null,null,null,null,null,null,"Spring2022"]
[" "," ",null,{"$f":"D136","v":"Semester Credits Earned"},{"$f":"SUM(E349:E358)","v":0},null,{"$f":"SUM(G349:G358)","v":0}]
[" "," ",null,{"$f":"D121","v":"Total Credits Earned"},{"$f":"E345+E359","v":120},null,{"$f":"G345-G359","v":120}]
[]
["Summer",{"$f":"B74+6","v":2022},{"$f":"C2","v":"Last Name, First Name"}]
["Course",{"$f":"B19","v":"Req."},{"$f":"C19","v":"Req."},"Course Title","Credits","Grade","Degree Credits","SemesterYear"]
[null,null,null,null,null,null,null,{"$f":"$A$362&$B$362","v":"Summer2022"}]
[null,null,null,null,null,null,null,{"$f":"$A$362&$B$362","v":"Summer2022"}]
[null,null,null,null,null,null,null,"Summer2022"]
[null,null,null,null,null,null,null,"Summer2022"]
[null,null,null,null,null,null,null,"Summer2022"]
[null,null,null,null,null,null,null,"Summer2022"]
[" "," ",null,{"$f":"D136","v":"Semester Credits Earned"},{"$f":"SUM(E364:E369)","v":0},null,{"$f":"SUM(G363:G369)","v":0}]
[" "," ",null,{"$f":"D121","v":"Total Credits Earned"},{"$f":"E360+E370","v":120},null,{"$f":"G360-G370","v":120}]
[]
[]
[null,"Graduation Plan Review & Approval"]
[]
[null," "]
[]
[null,"Initial Review: OASiS",null,null,"Date"]
[]
[]
[]
[null,"Additional Review: Faculty Mentor",null,null,"Date"]
[]
[null," ",null,null," "]
[]
[null,"Secondary Major Review",null,null,"Date"]
[]
[null," ",null,null," "]
[]
[null,"Final Review: OASiS Approval",null,null,"Date"]
[]
[null," ",null,null," "]
[]
[null,{"$f":"C2","v":"Last Name, First Name"},null,null,"Date"]
[]
[]
[]
[]
[null,"OASiS Comments"]

{"sheet":"Sample_Checklist","index":2,"n_rows":113,"n_cols":13,"rows_kept":113,"cut":false,"hidden":true,"merged":[[35,11,35,12],[36,11,36,12],[36,4,36,6],[0,0,0,8],[0,11,0,12],[1,11,1,12],[2,0,2,8],[17,0,17,8],[20,0,20,8],[1,4,1,6],[1,0,1,2],[25,0,25,2],[25,4,25,6],[36,0,36,2],[24,0,24,8],[26,0,26,8],[50,11,50,12],[51,11,51,12],[62,0,62,8],[62,11,62,12],[63,11,63,12],[51,0,51,2],[51,4,51,6],[63,0,63,2],[63,4,63,6],[83,11,83,12],[79,0,79,2],[79,4,79,6],[83,0,83,2],[83,4,83,6],[64,11,64,12],[74,0,74,8],[78,0,78,8],[82,0,82,8],[82,11,82,12],[28,0,28,8],[35,0,35,8],[75,0,75,2],[75,4,75,6],[105,0,105,8],[50,0,50,8],[106,0,106,8],[108,0,108,8],[84,0,84,8],[87,0,87,8],[89,0,89,8],[93,0,93,8],[97,0,97,8],[102,0,102,8]]}
["Checklist - Computer Science",null,null,null,null,null,null,null,null,null,"Sample_Plan Computer Science","Required Computer Science Electives"]
["Requirement",null,null,"Credits","Taken",null,null,"Semester","Credits",null,null,"List courses you are interested in possibly taking. (NOTE: This is not required.)"]
["Required Computer Science Courses",null,null,null,null,null,null,null,null,null,null,"Course","Title"]
["COMP.1010","or","91.101",3,"COMP.1010","or","91.101",{"$f":"IF(AND(ISNA(VLOOKUP(E4,INDIRECT(\"'\"&$K$1&\"'!$A$1:$H$550\"),8,FALSE)), ISNA(VLOOKUP(G4,INDIRECT(\"'\"&$K$1&\"'!$A$1:$H$550\"),8,FALSE))), \"Not Found\", (IF(ISNA(VLOOKUP(E4,INDIRECT(\"'\"&$K$1&\"'!$A$1:$H$550\"),8,FALSE)), VLOOKUP(G4,INDIRECT(\"'\"&$K$1&\"'!$A$1:$H$550\"),8,FALSE), VLOOKUP(E4,INDIRECT(\"'\"&$K$1&\"'!$A$1:$H$550\"),8,FALSE))))","v":"Fall2016"},{"$f":"IF(AND(ISNA(VLOOKUP(E4,INDIRECT(\"'\"&$K$1&\"'!$A$1:$H$550\"),5,FALSE)), ISNA(VLOOKUP(G4,INDIRECT(\"'\"&$K$1&\"'!$A$1:$H$550\"),5,FALSE))), \"0\", (IF(ISNA(VLOOKUP(E4,INDIRECT(\"'\"&$K$1&\"'!$A$1:$H$550\"),5,FALSE)), VLOOKUP(G4,INDIRECT(\"'\"&$K$1&\"'!$A$1:$H$550\"),5,FALSE), VLOOKUP(E4,INDIRECT(\"'\"&$K$1&\"'!$A$1:$H$550\"),5,FALSE))))","v":3}]
["COMP.1030L","or","91.103",1,"COMP.1030L","or","91.103",{"$f":"IF(AND(ISNA(VLOOKUP(E5,INDIRECT(\"'\"&$K$1&\"'!$A$1:$H$550\"),8,FALSE)), ISNA(VLOOKUP(G5,INDIRECT(\"'\"&$K$1&\"'!$A$1:$H$550\"),8,FALSE))), \"Not Found\", (IF(ISNA(VLOOKUP(E5,INDIRECT(\"'\"&$K$1&\"'!$A$1:$H$550\"),8,FALSE)), VLOOKUP(G5,INDIRECT(\"'\"&$K$1&\"'!$A$1:$H$550\"),8,FALSE), VLOOKUP(E5,INDIRECT(\"'\"&$K$1&\"'!$A$1:$H$550\"),8,FALSE))))","v":"Fall2016"},1]
["COMP.1020","or","91.102",3,"COMP.1020","or","91.102","Spring2017",{"$f":"IF(AND(ISNA(VLOOKUP(E6,INDIRECT(\"'\"&$K$1&\"'!$A$1:$H$550\"),5,FALSE)), ISNA(VLOOKUP(G6,INDIRECT(\"'\"&$K$1&\"'!$A$1:$H$550\"),5,FALSE))), \"0\", (IF(ISNA(VLOOKUP(E6,INDIRECT(\"'\"&$K$1&\"'!$A$1:$H$550\"),5,FALSE)), VLOOKUP(G6,INDIRECT(\"'\"&$K$1&\"'!$A$1:$H$550\"),5,FALSE), VLOOKUP(E6,INDIRECT(\"'\"&$K$1&\"'!$A$1:$H$550\"),5,FALSE))))","v":3}]
["COMP.1040L","or","91.104",1,"COMP.1040L","or","91.104","Spring2017",{"$f":"IF(AND(ISNA(VLOOKUP(E7,INDIRECT(\"'\"&$K$1&\"'!$A$1:$H$550\"),5,FALSE)), ISNA(VLOOKUP(G7,INDIRECT(\"'\"&$K$1&\"'!$A$1:$H$550\"),5,FALSE))), \"0\", (IF(ISNA(VLOOKUP(E7,INDIRECT(\"'\"&$K$1&\"'!$A$1:$H$550\"),5,FALSE)), VLOOKUP(G7,INDIRECT(\"'\"&$K$1&\"'!$A$1:$H$550\"),5,FALSE), VLOOKUP(E7,INDIRECT(\"'\"&$K$1&\"'!$A$1:$H$550\"),5,FALSE))))","v":1}]
["COMP.2010","or","91.201",3,"COMP.2010","or","91.201","Fall2017",3]
["COMP.2010L",null,null,1,"COMP.2010L",null,null,{"$f":"IF(AND(ISNA(VLOOKUP(E9,INDIRECT(\"'\"&$K$1&\"'!$A$1:$H$550\"),8,FALSE)), ISNA(VLOOKUP(G9,INDIRECT(\"'\"&$K$1&\"'!$A$1:$H$550\"),8,FALSE))), \"Not Found\", (IF(ISNA(VLOOKUP(E9,INDIRECT(\"'\"&$K$1&\"'!$A$1:$H$550\"),8,FALSE)), VLOOKUP(G9,INDIRECT(\"'\"&$K$1&\"'!$A$1:$H$550\"),8,FALSE), VLOOKUP(E9,INDIRECT(\"'\"&$K$1&\"'!$A$1:$H$550\"),8,FALSE))))","v":"Fall2017"},{"$f":"IF(AND(ISNA(VLOOKUP(E9,INDIRECT(\"'\"&$K$1&\"'!$A$1:$H$550\"),5,FALSE)), ISNA(VLOOKUP(G9,INDIRECT(\"'\"&$K$1&\"'!$A$1:$H$550\"),5,FALSE))), \"0\", (IF(ISNA(VLOOKUP(E9,INDIRECT(\"'\"&$K$1&\"'!$A$1:$H$550\"),5,FALSE)), VLOOKUP(G9,INDIRECT(\"'\"&$K$1&\"'!$A$1:$H$550\"),5,FALSE), VLOOKUP(E9,INDIRECT(\"'\"&$K$1&\"'!$A$1:$H$550\"),5,FALSE))))","v":1}]
["COMP.2030","or","91.203",3,"COMP.2030","or","91.203","Fall2017",3]
["COMP.2030L",null,null,1,"COMP.2030L",null,null,{"$f":"IF(AND(ISNA(VLOOKUP(E11,INDIRECT(\"'\"&$K$1&\"'!$A$1:$H$550\"),8,FALSE)), ISNA(VLOOKUP(G11,INDIRECT(\"'\"&$K$1&\"'!$A$1:$H$550\"),8,FALSE))), \"Not Found\", (IF(ISNA(VLOOKUP(E11,INDIRECT(\"'\"&$K$1&\"'!$A$1:$H$550\"),8,FALSE)), VLOOKUP(G11,INDIRECT(\"'\"&$K$1&\"'!$A$1:$H$550\"),8,FALSE), VLOOKUP(E11,INDIRECT(\"'\"&$K$1&\"'!$A$1:$H$550\"),8,FALSE))))","v":"Fall2017"},{"$f":"IF(AND(ISNA(VLOOKUP(E11,INDIRECT(\"'\"&$K$1&\"'!$A$1:$H$550\"),5,FALSE)), ISNA(VLOOKUP(G11,INDIRECT(\"'\"&$K$1&\"'!$A$1:$H$550\"),5,FALSE))), \"0\", (IF(ISNA(VLOOKUP(E11,INDIRECT(\"'\"&$K$1&\"'!$A$1:$H$550\"),5,FALSE)), VLOOKUP(G11,INDIRECT(\"'\"&$K$1&\"'!$A$1:$H$550\"),5,FALSE), VLOOKUP(E11,INDIRECT(\"'\"&$K$1&\"'!$A$1:$H$550\"),5,FALSE))))","v":1}]
["COMP.2040","or","91.204",3,"COMP.2040","or","91.204","Spring2018",3]
["COMP.3010","or","91.301",3,"COMP.3010","or","91.301","Spring2019",3]
["COMP.3040","or","91.304",3,"COMP.3040","or","91.304","Fall2018",3]
["COMP.3050","or","91.305",3,"COMP.3050","or","91.305","Fall2018",3]
["COMP.3080","or","91.308",3,"COMP.3080","or","91.308","Spring2019",3]
["COMP.4040","or","91.404",3,"COMP.4040","or","91.404","Fall2019",3]
["Required CS Electives"]
["CSE-1",null,null,3,{"$f":"IF(ISNA(INDEX(INDIRECT(\"'\"&$K$1&\"'!$A$1:$A$550\"), MATCH(A19,INDIRECT(\"'\"&$K$1&\"'!$B$1:$B$550\"),0))), \"Not Found\", (INDEX(INDIRECT(\"'\"&$K$1&\"'!$A$1:$A$550\"), MATCH(A19,INDIRECT(\"'\"&$K$1&\"'!$B$1:$B$550\"),0))))","v":"COMP.3/4xxx-1"},null,null,{"$f":"IF(ISNA(VLOOKUP(E19,INDIRECT(\"'\"&$K$1&\"'!$A$1:$H$550\"),8,FALSE)), \"Not Found\", VLOOKUP(E19,INDIRECT(\"'\"&$K$1&\"'!$A$1:$H$550\"),8,FALSE))","v":"Fall2019"},{"$f":"IF(ISNA(VLOOKUP(E19,INDIRECT(\"'\"&$K$1&\"'!$A$1:$H$550\"),5,FALSE)), \"0\", VLOOKUP(E19,INDIRECT(\"'\"&$K$1&\"'!$A$1:$H$550\"),5,FALSE))","v":3}]
["CSE-2",null,null,3,"COMP.3/4xxx-2",null,null,"Spring2020",3]
["CS Project Course"]
["Sr.Prj-1",null,null,3,"COMP.4xxx-p1",null,null,"Fall2019",3]
["Sr.Prj-2",null,null,3,"COMP.4xxx-p2",null,null,"Spring2020",3]
[]
["Required Supporting Technical Course"]
["Requirement",null,null,"Credits","Taken",null,null,"Semester","Credits"]
["Electrical Engineering"]
["EECE.2650","or","16.265",3,"EECE.2650","or","16.265",{"$f":"IF(AND(ISNA(VLOOKUP(E28,INDIRECT(\"'\"&$K$1&\"'!$A$1:$H$550\"),8,FALSE)), ISNA(VLOOKUP(G28,INDIRECT(\"'\"&$K$1&\"'!$A$1:$H$550\"),8,FALSE))), \"Not Found\", (IF(ISNA(VLOOKUP(E28,INDIRECT(\"'\"&$K$1&\"'!$A$1:$H$550\"),8,FALSE)), VLOOKUP(G28,INDIRECT(\"'\"&$K$1&\"'!$A$1:$H$550\"),8,FALSE), VLOOKUP(E28,INDIRECT(\"'\"&$K$1&\"'!$A$1:$H$550\"),8,FALSE))))","v":"Fall2017"},{"$f":"IF(AND(ISNA(VLOOKUP(E28,INDIRECT(\"'\"&$K$1&\"'!$A$1:$H$550\"),5,FALSE)), ISNA(VLOOKUP(G28,INDIRECT(\"'\"&$K$1&\"'!$A$1:$H$550\"),5,FALSE))), \"0\", (IF(ISNA(VLOOKUP(E28,INDIRECT(\"'\"&$K$1&\"'!$A$1:$H$550\"),5,FALSE)), VLOOKUP(G28,INDIRECT(\"'\"&$K$1&\"'!$A$1:$H$550\"),5,FALSE), VLOOKUP(E28,INDIRECT(\"'\"&$K$1&\"'!$A$1:$H$550\"),5,FALSE))))","v":3}]
["Mathematics"]
["MATH.1310","or","92.131",4,"MATH.1310","or","92.131",{"$f":"IF(AND(ISNA(VLOOKUP(E30,INDIRECT(\"'\"&$K$1&\"'!$A$1:$H$550\"),8,FALSE)), ISNA(VLOOKUP(G30,INDIRECT(\"'\"&$K$1&\"'!$A$1:$H$550\"),8,FALSE))), \"Not Found\", (IF(ISNA(VLOOKUP(E30,INDIRECT(\"'\"&$K$1&\"'!$A$1:$H$550\"),8,FALSE)), VLOOKUP(G30,INDIRECT(\"'\"&$K$1&\"'!$A$1:$H$550\"),8,FALSE), VLOOKUP(E30,INDIRECT(\"'\"&$K$1&\"'!$A$1:$H$550\"),8,FALSE))))","v":"Fall2016"},{"$f":"IF(AND(ISNA(VLOOKUP(E30,INDIRECT(\"'\"&$K$1&\"'!$A$1:$H$550\"),5,FALSE)), ISNA(VLOOKUP(G30,INDIRECT(\"'\"&$K$1&\"'!$A$1:$H$550\"),5,FALSE))), \"0\", (IF(ISNA(VLOOKUP(E30,INDIRECT(\"'\"&$K$1&\"'!$A$1:$H$550\"),5,FALSE)), VLOOKUP(G30,INDIRECT(\"'\"&$K$1&\"'!$A$1:$H$550\"),5,FALSE), VLOOKUP(E30,INDIRECT(\"'\"&$K$1&\"'!$A$1:$H$550\"),5,FALSE))))","v":4}]
["MATH.1320","or","92.132",4,"MATH.1320","or","92.132","Spring2017",4]
["MATH.3210","or","92.321",3,"MATH.3210","or","92.321","Fall2017",3]
["MATH.3220","or","92.322",3,"MATH.3220","or","92.322","Spring2018",3]
["MATH.3860","or","92.386",3,"MATH.3860","or","92.386","Spring2018",3]
[]
["Natural Science Electives",null,null,null,null,null,null,null,null,null,null,"Natural Science Electives"]
["Requirement",null,null,"Credits","Taken",null,null,"Semester","Credits",null,null,"List courses you are interested in possibly taking to satisfy this requirement"]
["NS-1",null,null,3,{"$f":"IF(ISNA(INDEX(INDIRECT(\"'\"&$K$1&\"'!$A$1:$A$550\"), MATCH(A38,INDIRECT(\"'\"&$K$1&\"'!$C$1:$C$550\"),0))), \"Not Found\", (INDEX(INDIRECT(\"'\"&$K$1&\"'!$A$1:$A$550\"), MATCH(A38,INDIRECT(\"'\"&$K$1&\"'!$C$1:$C$550\"),0))))","v":"NS-1"},null,null,{"$f":"IF(ISNA(VLOOKUP(E38,INDIRECT(\"'\"&$K$1&\"'!$A$1:$H$550\"),8,FALSE)), \"Not Found\", VLOOKUP(E38,INDIRECT(\"'\"&$K$1&\"'!$A$1:$H$550\"),8,FALSE))","v":"Spring2017"},{"$f":"IF(ISNA(VLOOKUP(E38,INDIRECT(\"'\"&$K$1&\"'!$A$1:$H$550\"),5,FALSE)), \"0\", VLOOKUP(E38,INDIRECT(\"'\"&$K$1&\"'!$A$1:$H$550\"),5,FALSE))","v":3},null,null,"Course","Title"]
["NS-Lab1",null,null,1,{"$f":"IF(ISNA(INDEX(INDIRECT(\"'\"&$K$1&\"'!$A$1:$A$550\"), MATCH(A39,INDIRECT(\"'\"&$K$1&\"'!$C$1:$C$550\"),0))), \"Not Found\", (INDEX(INDIRECT(\"'\"&$K$1&\"'!$A$1:$A$550\"), MATCH(A39,INDIRECT(\"'\"&$K$1&\"'!$C$1:$C$550\"),0))))","v":"NS-Lab1"},null,null,"Spring2017",1]
["NS-2",null,null,3,"NS-2",null,null,"Fall2018",3]
["NS-Lab2",null,null,1,"NS-Lab2",null,null,"Fall2018",1]
["NS-3",null,null,3,"NS-3",null,null,"Spring2019",3]
["NS-Lab3",null,null,1,"NS-Lab3",null,null,"Spring2019",1]
["Not Req.",null,null,"n/a","Not Found",null,null,"Not Found","0"]
["Not Req.",null,null,"n/a","Not Found",null,null,"Not Found","0"]
[]
[]
[]
[]
[]
["Technical Electives",null,null,null,null,null,null,null,null,null,null,"Technical Electives"]
["Requirement",null,null,"Credits","Taken",null,null,"Semester","Credits",null,null,"List courses you are interested in possibly taking to satisfy this requirement"]
["TE-1",null,null,3,{"$f":"IF(ISNA(INDEX(INDIRECT(\"'\"&$K$1&\"'!$A$1:$A$550\"), MATCH(A53,INDIRECT(\"'\"&$K$1&\"'!$B$1:$B$550\"),0))), \"Not Found\", (INDEX(INDIRECT(\"'\"&$K$1&\"'!$A$1:$A$550\"), MATCH(A53,INDIRECT(\"'\"&$K$1&\"'!$B$1:$B$550\"),0))))","v":"TechElec-1"},null,null,{"$f":"IF(ISNA(VLOOKUP(E53,INDIRECT(\"'\"&$K$1&\"'!$A$1:$H$550\"),8,FALSE)), \"Not Found\", VLOOKUP(E53,INDIRECT(\"'\"&$K$1&\"'!$A$1:$H$550\"),8,FALSE))","v":"Fall2019"},{"$f":"IF(ISNA(VLOOKUP(E53,INDIRECT(\"'\"&$K$1&\"'!$A$1:$H$550\"),5,FALSE)), \"0\", VLOOKUP(E53,INDIRECT(\"'\"&$K$1&\"'!$A$1:$H$550\"),5,FALSE))","v":3},null,null,"Course","Title"]
["TE-2",null,null,3,"TechElec-2",null,null,"Spring2020",3]
["Not Req.",null,null,"n/a","Not Found",null,null,"Not Found","0"]
["Not Req.",null,null,"n/a","Not Found",null,null,"Not Found","0"]
["Not Req.",null,null,"n/a","Not Found",null,null,"Not Found","0"]
[]
[]
[]
[]
[]
["Free Electives (FE)",null,null,null,null,null,null,null,null,null,null,"Free Electives"]
["Requirement",null,null,"Credits","Taken",null,null,"Semester","Credits",null,null,"List free electives you are interested in taking.  These cannot be below the level of a"]
["FE-1",null,null,3,{"$f":"IF(ISNA(INDEX(INDIRECT(\"'\"&$K$1&\"'!$A$1:$A$550\"), MATCH(\"*\"&A65&\"*\",INDIRECT(\"'\"&$K$1&\"'!$B$1:$B$550\"),0))), \"Not Found\", (INDEX(INDIRECT(\"'\"&$K$1&\"'!$A$1:$A$550\"), MATCH(\"*\"&A65&\"*\",INDIRECT(\"'\"&$K$1&\"'!$B$1:$B$550\"),0))))","v":"FE-1"},null,null,{"$f":"IF(ISNA(VLOOKUP(E65,INDIRECT(\"'\"&$K$1&\"'!$A$1:$H$550\"),8,FALSE)), \"Not Found\", VLOOKUP(E65,INDIRECT(\"'\"&$K$1&\"'!$A$1:$H$550\"),8,FALSE))","v":"Spring2018"},{"$f":"IF(ISNA(VLOOKUP(E65,INDIRECT(\"'\"&$K$1&\"'!$A$1:$H$550\"),5,FALSE)), \"0\", VLOOKUP(E65,INDIRECT(\"'\"&$K$1&\"'!$A$1:$H$550\"),5,FALSE))","v":3},null,null,"required course.  Specific courses may be recommended for different CS tracks."]
["FE-2",null,null,3,{"$f":"IF(ISNA(INDEX(INDIRECT(\"'\"&$K$1&\"'!$A$1:$A$550\"), MATCH(\"*\"&A66&\"*\",INDIRECT(\"'\"&$K$1&\"'!$B$1:$B$550\"),0))), \"Not Found\", (INDEX(INDIRECT(\"'\"&$K$1&\"'!$A$1:$A$550\"), MATCH(\"*\"&A66&\"*\",INDIRECT(\"'\"&$K$1&\"'!$B$1:$B$550\"),0))))","v":"FE-2"},null,null,"Fall2018",3]
["FE-3",null,null,3,"FE-3",null,null,"Spring2019",3]
["FE-4",null,null,3,"FE-4",null,null,"Fall2019",3]
["Not Req.",null,null,"n/a","Not Found",null,null,"Not Found","0"]
["Not Req.",null,null,"n/a","Not Found",null,null,"Not Found","0"]
[]
["Required FE Credits",null,null,null,null,null,null,"Projected Credits"]
[null,null,null,{"$f":"120-SUM(D4:D45, D53:D57, D86:D87,D91:D97)","v":12},null,null,null,null,{"$f":"SUM(I65:I71)","v":12}]
[]
["Oral & Written Communication"]
["Requirement",null,null,"Credits","Taken",null,null,"Semester","Credits"]
["ENGL.2200","or","42.220",3,"ENGL.2200","or","42.220",{"$f":"IF(AND(ISNA(VLOOKUP(E77,INDIRECT(\"'\"&$K$1&\"'!$A$1:$H$550\"),8,FALSE)), ISNA(VLOOKUP(G77,INDIRECT(\"'\"&$K$1&\"'!$A$1:$H$550\"),8,FALSE))), \"Not Found\", (IF(ISNA(VLOOKUP(E77,INDIRECT(\"'\"&$K$1&\"'!$A$1:$H$550\"),8,FALSE)), VLOOKUP(G77,INDIRECT(\"'\"&$K$1&\"'!$A$1:$H$550\"),8,FALSE), VLOOKUP(E77,INDIRECT(\"'\"&$K$1&\"'!$A$1:$H$550\"),8,FALSE))))","v":"Spring2019"},{"$f":"IF(AND(ISNA(VLOOKUP(E77,INDIRECT(\"'\"&$K$1&\"'!$A$1:$H$550\"),5,FALSE)), ISNA(VLOOKUP(G77,INDIRECT(\"'\"&$K$1&\"'!$A$1:$H$550\"),5,FALSE))), \"0\", (IF(ISNA(VLOOKUP(E77,INDIRECT(\"'\"&$K$1&\"'!$A$1:$H$550\"),5,FALSE)), VLOOKUP(G77,INDIRECT(\"'\"&$K$1&\"'!$A$1:$H$550\"),5,FALSE), VLOOKUP(E77,INDIRECT(\"'\"&$K$1&\"'!$A$1:$H$550\"),5,FALSE))))","v":3}]
[]
["CS Ethics Requirement"]
["Requirement",null,null,"Credits","Taken",null,null,"Semester","Credits"]
["CSET",null,null,3,{"$f":"IF(ISNA(INDEX(INDIRECT(\"'\"&$K$1&\"'!$A$1:$A$550\"), MATCH(A81,INDIRECT(\"'\"&$K$1&\"'!$C$1:$C$550\"),0))), \"Not Found\", (INDEX(INDIRECT(\"'\"&$K$1&\"'!$A$1:$A$550\"), MATCH(A81,INDIRECT(\"'\"&$K$1&\"'!$C$1:$C$550\"),0))))","v":"AH-2"},null,null,{"$f":"IF(ISNA(VLOOKUP(E81,INDIRECT(\"'\"&$K$1&\"'!$A$1:$H$550\"),8,FALSE)), \"Not Found\", VLOOKUP(E81,INDIRECT(\"'\"&$K$1&\"'!$A$1:$H$550\"),8,FALSE))","v":"Spring2018"},{"$f":"IF(ISNA(VLOOKUP(E81,INDIRECT(\"'\"&$K$1&\"'!$A$1:$H$550\"),5,FALSE)), \"0\", VLOOKUP(E81,INDIRECT(\"'\"&$K$1&\"'!$A$1:$H$550\"),5,FALSE))","v":3}]
[]
["Breadth of Knowledge",null,null,null,null,null,null,null,null,null,null," Breadth of Knowledge Requirements"]
["Requirement",null,null,"Credits","Taken",null,null,"Semester","Credits",null,null,"Select courses you are interested in taking to satisfy this Requirements."]
["College Writing",null,null,null,null,null,null,null,null,null,null,"Area","Title"]
["CW-1",null,null,3,{"$f":"IF(ISNA(INDEX(INDIRECT(\"'\"&$K$1&\"'!$A$1:$A$550\"), MATCH(A86,INDIRECT(\"'\"&$K$1&\"'!$B$1:$B$550\"),0))), \"Not Found\", (INDEX(INDIRECT(\"'\"&$K$1&\"'!$A$1:$A$550\"), MATCH(A86,INDIRECT(\"'\"&$K$1&\"'!$B$1:$B$550\"),0))))","v":"ENGL.1010"},null,null,{"$f":"IF(ISNA(VLOOKUP(E86,INDIRECT(\"'\"&$K$1&\"'!$A$1:$H$550\"),8,FALSE)), \"Not Found\", VLOOKUP(E86,INDIRECT(\"'\"&$K$1&\"'!$A$1:$H$550\"),8,FALSE))","v":"Transfer/AP"},{"$f":"IF(ISNA(VLOOKUP(E86,INDIRECT(\"'\"&$K$1&\"'!$A$1:$H$550\"),5,FALSE)), \"0\", VLOOKUP(E86,INDIRECT(\"'\"&$K$1&\"'!$A$1:$H$550\"),5,FALSE))","v":3}]
["CW-2",null,null,3,"ENGL.1020",null,null,"Fall2016",3]
["Mathematics"]
["MA",null,null,4,{"$f":"IF(ISNA(INDEX(INDIRECT(\"'\"&$K$1&\"'!$A$1:$A$550\"), MATCH(A89,INDIRECT(\"'\"&$K$1&\"'!$B$1:$B$550\"),0))), \"Not Found\", (INDEX(INDIRECT(\"'\"&$K$1&\"'!$A$1:$A$550\"), MATCH(A89,INDIRECT(\"'\"&$K$1&\"'!$B$1:$B$550\"),0))))","v":"MATH.1310"},null,null,{"$f":"IF(ISNA(VLOOKUP(E89,INDIRECT(\"'\"&$K$1&\"'!$A$1:$H$550\"),8,FALSE)), \"Not Found\", VLOOKUP(E89,INDIRECT(\"'\"&$K$1&\"'!$A$1:$H$550\"),8,FALSE))","v":"Fall2016"},{"$f":"IF(ISNA(VLOOKUP(E89,INDIRECT(\"'\"&$K$1&\"'!$A$1:$H$550\"),5,FALSE)), \"0\", VLOOKUP(E89,INDIRECT(\"'\"&$K$1&\"'!$A$1:$H$550\"),5,FALSE))","v":4}]
["Arts & Humanities"]
["AH-1",null,null,3,{"$f":"IF(ISNA(INDEX(INDIRECT(\"'\"&$K$1&\"'!$A$1:$A$550\"), MATCH(\"*\"&A91&\"*\",INDIRECT(\"'\"&$K$1&\"'!$B$1:$B$550\"),0))), \"Not Found\", (INDEX(INDIRECT(\"'\"&$K$1&\"'!$A$1:$A$550\"), MATCH(\"*\"&A91&\"*\",INDIRECT(\"'\"&$K$1&\"'!$B$1:$B$550\"),0))))","v":"AH-1"},null,null,{"$f":"IF(ISNA(VLOOKUP(E91,INDIRECT(\"'\"&$K$1&\"'!$A$1:$H$550\"),8,FALSE)), \"Not Found\", VLOOKUP(E91,INDIRECT(\"'\"&$K$1&\"'!$A$1:$H$550\"),8,FALSE))","v":"Spring2017"},{"$f":"IF(ISNA(VLOOKUP(E91,INDIRECT(\"'\"&$K$1&\"'!$A$1:$H$550\"),5,FALSE)), \"0\", VLOOKUP(E91,INDIRECT(\"'\"&$K$1&\"'!$A$1:$H$550\"),5,FALSE))","v":3}]
["AH-2",null,null,3,{"$f":"IF(ISNA(INDEX(INDIRECT(\"'\"&$K$1&\"'!$A$1:$A$550\"), MATCH(\"*\"&A92&\"*\",INDIRECT(\"'\"&$K$1&\"'!$B$1:$B$550\"),0))), \"Not Found\", (INDEX(INDIRECT(\"'\"&$K$1&\"'!$A$1:$A$550\"), MATCH(\"*\"&A92&\"*\",INDIRECT(\"'\"&$K$1&\"'!$B$1:$B$550\"),0))))","v":"AH-2"},null,null,"Spring2018",3]
["AH-3",null,null,3,"ENGL.2200",null,null,"Spring2019",3]
["Social Sciences"]
["SS-1",null,null,3,{"$f":"IF(ISNA(INDEX(INDIRECT(\"'\"&$K$1&\"'!$A$1:$A$550\"), MATCH(\"*\"&A95&\"*\",INDIRECT(\"'\"&$K$1&\"'!$B$1:$B$550\"),0))), \"Not Found\", (INDEX(INDIRECT(\"'\"&$K$1&\"'!$A$1:$A$550\"), MATCH(\"*\"&A95&\"*\",INDIRECT(\"'\"&$K$1&\"'!$B$1:$B$550\"),0))))","v":"ECON.2010"},null,null,{"$f":"IF(ISNA(VLOOKUP(E95,INDIRECT(\"'\"&$K$1&\"'!$A$1:$H$550\"),8,FALSE)), \"Not Found\", VLOOKUP(E95,INDIRECT(\"'\"&$K$1&\"'!$A$1:$H$550\"),8,FALSE))","v":"Transfer/AP"},{"$f":"IF(ISNA(VLOOKUP(E95,INDIRECT(\"'\"&$K$1&\"'!$A$1:$H$550\"),5,FALSE)), \"0\", VLOOKUP(E95,INDIRECT(\"'\"&$K$1&\"'!$A$1:$H$550\"),5,FALSE))","v":3}]
["SS-2",null,null,3,"SOCI.2320",null,null,"Fall2016",3]
["SS-3",null,null,3,"SS-3",null,null,"Spring2020",3]
["Sciences with Lab"]
["SC-1",null,null,3,{"$f":"IF(ISNA(INDEX(INDIRECT(\"'\"&$K$1&\"'!$A$1:$A$550\"), MATCH(A99,INDIRECT(\"'\"&$K$1&\"'!$B$1:$B$550\"),0))), \"Not Found\", (INDEX(INDIRECT(\"'\"&$K$1&\"'!$A$1:$A$550\"), MATCH(A99,INDIRECT(\"'\"&$K$1&\"'!$B$1:$B$550\"),0))))","v":"NS-1"},null,null,{"$f":"IF(ISNA(VLOOKUP(E99,INDIRECT(\"'\"&$K$1&\"'!$A$1:$H$550\"),8,FALSE)), \"Not Found\", VLOOKUP(E99,INDIRECT(\"'\"&$K$1&\"'!$A$1:$H$550\"),8,FALSE))","v":"Spring2017"},{"$f":"IF(ISNA(VLOOKUP(E99,INDIRECT(\"'\"&$K$1&\"'!$A$1:$H$550\"),5,FALSE)), \"0\", VLOOKUP(E99,INDIRECT(\"'\"&$K$1&\"'!$A$1:$H$550\"),5,FALSE))","v":3}]
["SCL-1",null,null,1,"NS-Lab1",null,null,"Spring2017",1]
["SC-2",null,null,3,"NS-2",null,null,"Fall2018",3]
["SCL-2",null,null,1,"NS-Lab2",null,null,"Fall2018",1]
["STEM"]
["STEM",null,null,3,{"$f":"IF(ISNA(INDEX(INDIRECT(\"'\"&$K$1&\"'!$A$1:$A$550\"), MATCH(A104,INDIRECT(\"'\"&$K$1&\"'!$B$1:$B$550\"),0))), \"Not Found\", (INDEX(INDIRECT(\"'\"&$K$1&\"'!$A$1:$A$550\"), MATCH(A104,INDIRECT(\"'\"&$K$1&\"'!$B$1:$B$550\"),0))))","v":"NS-3"},null,null,{"$f":"IF(ISNA(VLOOKUP(E104,INDIRECT(\"'\"&$K$1&\"'!$A$1:$H$550\"),8,FALSE)), \"Not Found\", VLOOKUP(E104,INDIRECT(\"'\"&$K$1&\"'!$A$1:$H$550\"),8,FALSE))","v":"Spring2019"},{"$f":"IF(ISNA(VLOOKUP(E104,INDIRECT(\"'\"&$K$1&\"'!$A$1:$H$550\"),5,FALSE)), \"0\", VLOOKUP(E104,INDIRECT(\"'\"&$K$1&\"'!$A$1:$H$550\"),5,FALSE))","v":3}]
[]
["Diversity & Ethics ELOs"]
["Diversity & Cultural Awareness (DV)"]
["DV",null,null,3,{"$f":"IF(ISNA(INDEX(INDIRECT(\"'\"&$K$1&\"'!$A$1:$A$550\"), MATCH(\"*\"&A108&\"*\",INDIRECT(\"'\"&$K$1&\"'!$B$1:$B$550\"),0))), \"Not Found\", (INDEX(INDIRECT(\"'\"&$K$1&\"'!$A$1:$A$550\"), MATCH(\"*\"&A108&\"*\",INDIRECT(\"'\"&$K$1&\"'!$B$1:$B$550\"),0))))","v":"SOCI.2320"},null,null,{"$f":"IF(ISNA(VLOOKUP(E108,INDIRECT(\"'\"&$K$1&\"'!$A$1:$H$550\"),8,FALSE)), \"Not Found\", VLOOKUP(E108,INDIRECT(\"'\"&$K$1&\"'!$A$1:$H$550\"),8,FALSE))","v":"Fall2016"},{"$f":"IF(ISNA(VLOOKUP(E108,INDIRECT(\"'\"&$K$1&\"'!$A$1:$H$550\"),5,FALSE)), \"0\", VLOOKUP(E108,INDIRECT(\"'\"&$K$1&\"'!$A$1:$H$550\"),5,FALSE))","v":3}]
["Social Responsibility & Ethics (ET)"]
["ET",null,null,3,{"$f":"IF(ISNA(INDEX(INDIRECT(\"'\"&$K$1&\"'!$A$1:$A$550\"), MATCH(\"*\"&A110&\"*\",INDIRECT(\"'\"&$K$1&\"'!$B$1:$B$550\"),0))), \"Not Found\", (INDEX(INDIRECT(\"'\"&$K$1&\"'!$A$1:$A$550\"), MATCH(\"*\"&A110&\"*\",INDIRECT(\"'\"&$K$1&\"'!$B$1:$B$550\"),0))))","v":"AH-2"},null,null,{"$f":"IF(ISNA(VLOOKUP(E110,INDIRECT(\"'\"&$K$1&\"'!$A$1:$H$550\"),8,FALSE)), \"Not Found\", VLOOKUP(E110,INDIRECT(\"'\"&$K$1&\"'!$A$1:$H$550\"),8,FALSE))","v":"Spring2018"},{"$f":"IF(ISNA(VLOOKUP(E110,INDIRECT(\"'\"&$K$1&\"'!$A$1:$H$550\"),5,FALSE)), \"0\", VLOOKUP(E110,INDIRECT(\"'\"&$K$1&\"'!$A$1:$H$550\"),5,FALSE))","v":3}]
[]
["Degree Credits",null,null,null,null,null,null,null,"Projected Degree Credits "]
[null,null,null,{"$f":"SUM(D1:D45,D53:D70,D86,D87,D91:D97)","v":120},null,null,null,null,{"$f":"SUM(I1:I45, I53:I57,I73,I86,I87,I91:I97)","v":120}]

{"sheet":"Sample_Plan_Data_Science","index":3,"n_rows":399,"n_cols":8,"rows_kept":399,"cut":false,"hidden":true,"merged":[[3,0,3,1],[3,2,3,5],[0,0,0,5],[1,0,1,1],[1,2,1,5],[2,0,2,1],[2,2,2,5],[4,0,4,1],[4,2,4,5],[5,0,5,1],[5,2,5,5],[6,0,6,1],[6,2,6,5],[7,0,7,1],[7,2,7,5],[8,0,8,1],[8,2,8,5],[9,0,9,1],[9,2,9,5],[72,0,72,5],[10,0,10,6],[11,0,11,3],[11,4,11,5],[12,0,12,3],[12,4,12,5],[13,0,13,6],[14,0,14,3],[15,0,15,6],[16,0,16,5],[17,0,17,5],[71,0,71,6],[146,2,146,5],[73,2,73,5],[87,0,87,6],[88,2,88,5],[96,2,96,5],[110,0,110,6],[111,2,111,5],[121,0,121,6],[122,0,122,5],[123,2,123,5],[137,0,137,6],[138,2,138,5],[222,0,222,5],[160,0,160,6],[161,2,161,5],[171,0,171,6],[172,0,172,5],[173,2,173,5],[187,0,187,6],[188,2,188,5],[196,2,196,5],[210,0,210,6],[211,2,211,5],[221,0,221,6],[296,2,296,5],[223,2,223,5],[237,0,237,6],[238,2,238,5],[246,2,246,5],[260,0,260,6],[261,2,261,5],[271,0,271,6],[272,0,272,5],[273,2,273,5],[287,0,287,6],[288,2,288,5],[373,1,373,4],[310,0,310,6],[311,2,311,5],[321,0,321,6],[322,0,322,5],[323,2,323,5],[337,0,337,6],[338,2,338,5],[346,3,346,5],[360,0,360,6],[361,2,361,5],[371,0,371,6],[389,1,389,3],[375,1,376,3],[375,4,376,4],[377,1,377,3],[379,1,380,3],[379,4,380,4],[381,1,381,3],[383,1,384,3],[383,4,384,4],[385,1,385,3],[387,1,388,3],[387,4,388,4],[391,1,392,3],[391,4,392,4],[393,1,393,3],[398,1,398,4],[399,1,399,4]]}
["CS: Data Science Graduation Plan"]
["Student Name",null,"Last Name, First Name"]
["University Id (not ss#)"]
["Email"]
["Primary Major (Option)",null,"Computer Science (Data Science Option)"]
["Second Major:"]
["Third Major:"]
["Minors(s):"]
["Special Program(s):"]
["Scholarships:"]
[]
["Matriculation Date (Month/Year)",null,null,null,"Sept. 2016"]
["Expected Graduation Date (Month/Year)",null,null,null,"June 2020"]
[]
["Minimum Number of Credits Required for Degree(s)",null,null,null,120]
[]
["Transfer and AP Credits"]
[]
["Course","Req.","Req.","Course Title","Credits","Grade","Degree Credits","SemesterYear"]
[null,null,null,"AP: Physics C - Mechanics",0,2,null,"Transfer/AP"]
["ECON.2010","SS-1",null,"AP: Microeconomics",3,4,null,"Transfer/AP"]
["ENGL.1010","CW-1",null,"English Literature & Composition",3,"A-",null,"Transfer/AP"]
[null,null,null,null,null,null,null,"Transfer/AP"]
[null,null,null,null,null,null,null,"Transfer/AP"]
[null,null,null,null,null,null,null,"Transfer/AP"]
[null,null,null,null,null,null,null,"Transfer/AP"]
[null,null,null,null,null,null,null,"Transfer/AP"]
[null,null,null,null,null,null,null,"Transfer/AP"]
[null,null,null,null,null,null,null,"Transfer/AP"]
[null,null,null,null,null,null,null,"Transfer/AP"]
[null,null,null,null,null,null,null,"Transfer/AP"]
[null,null,null,null,null,null,null,"Transfer/AP"]
[null,null,null,null,null,null,null,"Transfer/AP"]
[null,null,null,null,null,null,null,"Transfer/AP"]
[null,null,null,null,null,null,null,"Transfer/AP"]
[null,null,null,null,null,null,null,"Transfer/AP"]
[null,null,null,null,null,null,null,"Transfer/AP"]
[null,null,null,null,null,null,null,"Transfer/AP"]
[null,null,null,null,null,null,null,"Transfer/AP"]
[null,null,null,null,null,null,null,"Transfer/AP"]
[null,null,null,null,null,null,null,"Transfer/AP"]
[null,null,null,null,null,null,null,"Transfer/AP"]
[null,null,null,null,null,null,null,"Transfer/AP"]
[null,null,null,null,null,null,null,"Transfer/AP"]
[null,null,null,null,null,null,null,"Transfer/AP"]
[null,null,null,null,null,null,null,"Transfer/AP"]
[null,null,null,null,null,null,null,"Transfer/AP"]
[null,null,null,null,null,null,null,"Transfer/AP"]
[null,null,null,null,null,null,null,"Transfer/AP"]
[null,null,null,null,null,null,null,"Transfer/AP"]
[null,null,null,null,null,null,null,"Transfer/AP"]
[null,null,null,null,null,null,null,"Transfer/AP"]
[null,null,null,null,null,null,null,"Transfer/AP"]
[null,null,null,null,null,null,null,"Transfer/AP"]
[null,null,null,null,null,null,null,"Transfer/AP"]
[null,null,null,null,null,null,null,"Transfer/AP"]
[null,null,null,null,null,null,null,"Transfer/AP"]
[null,null,null,null,null,null,null,"Transfer/AP"]
[null,null,null,null,null,null,null,"Transfer/AP"]
[null,null,null,null,null,null,null,"Transfer/AP"]
[null,null,null,null,null,null,null,"Transfer/AP"]
[null,null,null,null,null,null,null,"Transfer/AP"]
[null,null,null,null,null,null,null,"Transfer/AP"]
[null,null,null,null,null,null,null,"Transfer/AP"]
[null,null,null,null,null,null,null,"Transfer/AP"]
[null,null,null,null,null,null,null,"Transfer/AP"]
[null,null,null,null,null,null,null,"Transfer/AP"]
[null,null,null,null,null,null,null,"Transfer/AP"]
[null,null,null,null,null,null,null,"Transfer/AP"]
[" "," ",null,"Transfer and AP Credits",{"$f":"SUM(E20:E69)","v":6},null,{"$f":"SUM(G20:G69)","v":0}]
[" "," ",null,"Total Credits Earned",{"$f":"E70","v":6},null,{"$f":"E15-G70","v":120}]
[]
["Year 1"]
["Fall","2016",{"$f":"C2","v":"Last Name, First Name"}]
["Course",{"$f":"B19","v":"Req."},{"$f":"C19","v":"Req."},"Course Title","Credits","Grade","Degree Credits","SemesterYear"]
["COMP.1010",null,null,"Computing I",3,null,null,{"$f":"$A$74&$B$74","v":"Fall2016"}]
["COMP.1030L",null,null,"Computing I Lab",1,null,null,{"$f":"$A$74&$B$74","v":"Fall2016"}]
["MATH.1310","MA",null,"Calculus I",4,null,null,"Fall2016"]
["ENGL.1020","CW-2",null,"College Writing II",3,null,null,"Fall2016"]
["SOCI.2320","SS-2,DV",null,"Social Psychology",3,null,null,"Fall2016"]
[null,null,null,null,null,null,null,"Fall2016"]
[null,null,null,null,null,null,null,"Fall2016"]
[null,null,null,null,null,null,null,"Fall2016"]
[null,null,null,null,null,null,null,"Fall2016"]
[null,null,null,null,null,null,null,"Fall2016"]
[" "," ",null,"Semester Credits Earned",{"$f":"SUM(E76:E85)","v":14},null,{"$f":"SUM(G76:G85)","v":0}]
[" "," ",null,{"$f":"D71","v":"Total Credits Earned"},{"$f":"E71+E86","v":20},null,{"$f":"G71-G86","v":120}]
[]
["Winter",{"$f":"B74+1","v":2017},{"$f":"C2","v":"Last Name, First Name"}]
["Course",{"$f":"B19","v":"Req."},null,"Course Title","Credits","Grade","Degree Credits","SemesterYear"]
[null,null,null,null,null,null,null,{"$f":"$A$89&$B$89","v":"Winter2017"}]
[null,null,null,null,null,null,null,{"$f":"$A$89&$B$89","v":"Winter2017"}]
[null,null,null,null,null,null,null,"Winter2017"]
[" "," ",null,{"$f":"D86","v":"Semester Credits Earned"},{"$f":"SUM(E91:E93)","v":0},null,{"$f":"SUM(G91:G93)","v":0}]
[" "," ",null,{"$f":"D71","v":"Total Credits Earned"},{"$f":"E87+E94","v":20},null,{"$f":"G87-G94","v":120}]
[]
["Spring",{"$f":"B74+1","v":2017},{"$f":"C2","v":"Last Name, First Name"}]
["Course",{"$f":"B19","v":"Req."},{"$f":"C19","v":"Req."},"Course Title","Credits","Grade","Degree Credits","SemesterYear"]
["COMP.1020",null,null,"Computing II",3,null,null,{"$f":"$A$97&$B$97","v":"Spring2017"}]
["COMP.1040L",null,null,"Computer II Lab",1,null,null,{"$f":"$A$97&$B$97","v":"Spring2017"}]
["MATH.1320",null,null,"Calculus II",4,null,null,"Spring2017"]
["NS-1","SC-1","NS-1","Natural Science Lecture",3,null,null,"Spring2017"]
["NS-Lab1","SCL-1","NS-Lab1","Natural Science Lab",1,null,null,"Spring2017"]
["AH-1","AH-1",null,"Breadth of Knowledge Requirement",3,null,null,"Spring2017"]
[null,null,null,null,null,null,null,"Spring2017"]
[null,null,null,null,null,null,null,"Spring2017"]
[null,null,null,null,null,null,null,"Spring2017"]
[null,null,null,null,null,null,null,"Spring2017"]
[" "," ",null,{"$f":"D86","v":"Semester Credits Earned"},{"$f":"SUM(E99:E108)","v":15},null,{"$f":"SUM(G99:G108)","v":0}]
[" "," ",null,{"$f":"D71","v":"Total Credits Earned"},{"$f":"E95+E109","v":35},null,{"$f":"G95-G109","v":120}]
[]
["Summer",{"$f":"B74+1","v":2017},{"$f":"C2","v":"Last Name, First Name"}]
["Course",{"$f":"B19","v":"Req."},{"$f":"C19","v":"Req."},"Course Title","Credits","Grade","Degree Credits","SemesterYear"]
[null,null,null,null,null,null,null,{"$f":"$A$112&$B$112","v":"Summer2017"}]
[null,null,null,null,null,null,null,{"$f":"$A$112&$B$112","v":"Summer2017"}]
[null,null,null,null,null,null,null,"Summer2017"]
[null,null,null,null,null,null,null,"Summer2017"]
[null,null,null,null,null,null,null,"Summer2017"]
[null,null,null,null,null,null,null,"Summer2017"]
[" "," ",null,{"$f":"D86","v":"Semester Credits Earned"},{"$f":"SUM(E114:E119)","v":0},null,{"$f":"SUM(G114:G119)","v":0}]
[" "," ",null,{"$f":"D71","v":"Total Credits Earned"},{"$f":"E110+E120","v":35},null,{"$f":"G110-G120","v":120}]
[]
["Year 2"]
["Fall",{"$f":"B74+1","v":2017},{"$f":"C2","v":"Last Name, First Name"}]
["Course",{"$f":"B19","v":"Req."},{"$f":"C19","v":"Req."},"Course Title","Credits","Grade","Degree Credits","SemesterYear"]
["COMP.2010",null,null,"Computing III",3,null,null,{"$f":"$A$124&$B$124","v":"Fall2017"}]
["COMP.2010L",null,null,"Computing III Lab",1,null,null,{"$f":"$A$124&$B$124","v":"Fall2017"}]
["COMP.2030",null,null,"Assembly Language Programming",3,null,null,"Fall2017"]
["COMP.2030L",null,null,"Assembly Language Programming Lab",1,null,null,"Fall2017"]
["MATH.2210",null,null,"Linear Algebra I",3,null,null,"Fall2017"]
["MATH.3210",null,null,"Discrete Structures I",3,null,null,"Fall2017"]
["EECE.2650",null,null,"Logic Design",3,null,null,"Fall2017"]
[null,null,null,null,null,null,null,"Fall2017"]
[null,null,null,null,null,null,null,"Fall2017"]
[null,null,null,null,null,null,null,"Fall2017"]
[" "," ",null,{"$f":"D86","v":"Semester Credits Earned"},{"$f":"SUM(E126:E135)","v":17},null,{"$f":"SUM(G126:G135)","v":0}]
[" "," ",null,{"$f":"D71","v":"Total Credits Earned"},{"$f":"E121+E136","v":52},null,{"$f":"G121-G136","v":120}]
[]
["Winter",{"$f":"B74+2","v":2018},{"$f":"C2","v":"Last Name, First Name"}]
["Course",{"$f":"B19","v":"Req."},{"$f":"C19","v":"Req."},"Course Title","Credits","Grade","Degree Credits","SemesterYear"]
[null,null,null,null,null,null,null,{"$f":"$A$139&$B$139","v":"Winter2018"}]
[null,null,null,null,null,null,null,{"$f":"$A$139&$B$139","v":"Winter2018"}]
[null,null,null,null,null,null,null,"Winter2018"]
[" "," ",null,{"$f":"D86","v":"Semester Credits Earned"},{"$f":"SUM(E141:E143)","v":0},null,{"$f":"SUM(G141:G143)","v":0}]
[" "," ",null,{"$f":"D71","v":"Total Credits Earned"},{"$f":"E137+E144","v":52},null,{"$f":"G137-G144","v":120}]
[]
["Spring",{"$f":"B89+1","v":2018},{"$f":"C2","v":"Last Name, First Name"}]
["Course",{"$f":"B19","v":"Req."},{"$f":"C19","v":"Req."},"Course Title","Credits","Grade","Degree Credits","SemesterYear"]
["COMP.2040",null,null,"Computing IV",3,null,null,{"$f":"$A$147&$B$147","v":"Spring2018"}]
["MATH.2220",null,null,"Linear Algebra II",3,null,null,{"$f":"$A$147&$B$147","v":"Spring2018"}]
["MATH.3220",null,null,"Discrete Structures II",3,null,null,"Spring2018"]
["MATH.3860",null,null,"Probability and Statistics I",3,null,null,"Spring2018"]
["AH-2","AH-2,ET","CSET","Breadth of Knowledge Requirement",3,null,null,"Spring2018"]
[null,null,null,null,null,null,null,"Spring2018"]
[null,null,null,null,null,null,null,"Spring2018"]
[null,null,null,null,null,null,null,"Spring2018"]
[null,null,null,null,null,null,null,"Spring2018"]
[null,null,null,null,null,null,null,"Spring2018"]
[" "," ",null,{"$f":"D86","v":"Semester Credits Earned"},{"$f":"SUM(E149:E158)","v":15},null,{"$f":"SUM(G149:G158)","v":0}]
[" "," ",null,{"$f":"D71","v":"Total Credits Earned"},{"$f":"E145+E159","v":67},null,{"$f":"G145-G159","v":120}]
[]
["Summer",{"$f":"B74+2","v":2018},{"$f":"C2","v":"Last Name, First Name"}]
["Course",{"$f":"B19","v":"Req."},{"$f":"C19","v":"Req."},"Course Title","Credits","Grade","Degree Credits","SemesterYear"]
[null,null,null,null,null,null,null,{"$f":"$A$162&$B$162","v":"Summer2018"}]
[null,null,null,null,null,null,null,{"$f":"$A$162&$B$162","v":"Summer2018"}]
[null,null,null,null,null,null,null,"Summer2018"]
[null,null,null,null,null,null,null,"Summer2018"]
[null,null,null,null,null,null,null,"Summer2018"]
[null,null,null,null,null,null,null,"Summer2018"]
[" "," ",null,{"$f":"D86","v":"Semester Credits Earned"},{"$f":"SUM(E164:E169)","v":0},null,{"$f":"SUM(G163:G169)","v":0}]
[" "," ",null,{"$f":"D71","v":"Total Credits Earned"},{"$f":"E160+E170","v":67},null,{"$f":"G160-G170","v":120}]
[]
["Year 3"]
["Fall",{"$f":"B74+2","v":2018},{"$f":"C2","v":"Last Name, First Name"}]
["Course",{"$f":"B19","v":"Req."},{"$f":"C19","v":"Req."},"Course Title","Credits","Grade","Degree Credits","SemesterYear"]
["COMP.3040",null,null,"Foundations of Computer Science",3,null,null,{"$f":"$A$174&$B$174","v":"Fall2018"}]
["COMP.3050",null,null,"Computer Architecture",3,null,null,{"$f":"$A$174&$B$174","v":"Fall2018"}]
["MATH.2310",null,null,"Calculus III",4,null,null,"Fall2018"]
["ENGL.2200","AH-3",null,"Oral & Written Communication for CS",3,null,null,"Fall2018"]
["FE-1","FE-1",null,"Free Elective",3,null,null,"Fall2018"]
[null,null,null,null,null,null,null,"Fall2018"]
[null,null,null,null,null,null,null,"Fall2018"]
[null,null,null,null,null,null,null,"Fall2018"]
[null,null,null,null,null,null,null,"Fall2018"]
[null,null,null,null,null,null,null,"Fall2018"]
[" "," ",null,{"$f":"D86","v":"Semester Credits Earned"},{"$f":"SUM(E176:E185)","v":16},null,{"$f":"SUM(G176:G185)","v":0}]
[" "," ",null,{"$f":"D71","v":"Total Credits Earned"},{"$f":"E171+E186","v":83},null,{"$f":"G171-G186","v":120}]
[]
["Winter",{"$f":"B74+3","v":2019},{"$f":"C2","v":"Last Name, First Name"}]
["Course",{"$f":"B19","v":"Req."},{"$f":"C19","v":"Req."},"Course Title","Credits","Grade","Degree Credits","SemesterYear"]
[null,null,null,null,null,null,null,{"$f":"$A$189&$B$189","v":"Winter2019"}]
[null,null,null,null,null,null,null,{"$f":"$A$189&$B$189","v":"Winter2019"}]
[null,null,null,null,null,null,null,"Winter2019"]
[" "," ",null,{"$f":"D86","v":"Semester Credits Earned"},{"$f":"SUM(E191:E193)","v":0},null,{"$f":"SUM(G191:G193)","v":0},{"$f":"SUM(H191:H193)","v":0}]
[" "," ",null,{"$f":"D71","v":"Total Credits Earned"},{"$f":"E187+E194","v":83},null,{"$f":"G187-G194","v":120}]
[]
["Spring",{"$f":"B74+3","v":2019},{"$f":"C2","v":"Last Name, First Name"}]
["Course",{"$f":"B19","v":"Req."},{"$f":"C19","v":"Req."},"Course Title","Credits","Grade","Degree Credits","SemesterYear"]
["COMP.3010",null,null,"Organization of Programming Languages",3,null,null,{"$f":"$A$197&$B$197","v":"Spring2019"}]
["COMP.3080",null,null,"Introduction to Operating Systems",3,null,null,{"$f":"$A$197&$B$197","v":"Spring2019"}]
["COMP.4220",null,"Sr.Prj-1","Machine Learning",3,null,null,"Spring2019"]
["TE-1","TE-1",null,"Technical Elective",3,null,null,"Spring2019"]
[null,null,null,null,null,null,null,"Spring2019"]
[null,null,null,null,null,null,null,"Spring2019"]
[null,null,null,null,null,null,null,"Spring2019"]
[null,null,null,null,null,null,null,"Spring2019"]
[null,null,null,null,null,null,null,"Spring2019"]
[null,null,null,null,null,null,null,"Spring2019"]
[" "," ",null,{"$f":"D86","v":"Semester Credits Earned"},{"$f":"SUM(E199:E208)","v":12},null,{"$f":"SUM(G199:G208)","v":0}]
[" "," ",null,{"$f":"D71","v":"Total Credits Earned"},{"$f":"E195+E209","v":95},null,{"$f":"G195-G209","v":120}]
[]
["Summer",{"$f":"B74+3","v":2019},{"$f":"C2","v":"Last Name, First Name"}]
["Course",{"$f":"B19","v":"Req."},{"$f":"C19","v":"Req."},"Course Title","Credits","Grade","Degree Credits","SemesterYear"]
[null,null,null,null,null,null,null,{"$f":"$A$212&$B$212","v":"Summer2019"}]
[null,null,null,null,null,null,null,{"$f":"$A$212&$B$212","v":"Summer2019"}]
[null,null,null,null,null,null,null,"Summer2019"]
[null,null,null,null,null,null,null,"Summer2019"]
[null,null,null,null,null,null,null,"Summer2019"]
[null,null,null,null,null,null,null,"Summer2019"]
[" "," ",null,{"$f":"D86","v":"Semester Credits Earned"},{"$f":"SUM(E214:E219)","v":0},null,{"$f":"SUM(G213:G219)","v":0}]
[" "," ",null,{"$f":"D71","v":"Total Credits Earned"},{"$f":"E210+E220","v":95},null,{"$f":"G210-G220","v":120}]
[]
["Year 4"]
["Fall",{"$f":"B74+3","v":2019},{"$f":"C2","v":"Last Name, First Name"}]
["Course",{"$f":"B19","v":"Req."},{"$f":"C19","v":"Req."},"Course Title","Credits","Grade","Degree Credits","SemesterYear"]
["COMP.4040",null,null,"Analysis of Algorithms",3,null,null,{"$f":"$A$224&$B$224","v":"Fall2019"}]
["COMP.3/4xxx-1","DSE-1","Sr.Prj-2","Project Course - part 2",3,null,null,{"$f":"$A$224&$B$224","v":"Fall2019"}]
["COMP.3/4xxx-2","CSE-1",null,"Computer Science Upper-level Elective",3,null,null,"Fall2019"]
["NS-2","SC-2","NS-2","Natural Science Lecture",3,null,null,"Fall2019"]
["NS-Lab2","SCL-2","NS-Lab2","Natural Science Lab",1,null,null,"Fall2019"]
[null,null,null,null,null,null,null,"Fall2019"]
[null,null,null,null,null,null,null,"Fall2019"]
[null,null,null,null,null,null,null,"Fall2019"]
[null,null,null,null,null,null,null,"Fall2019"]
[null,null,null,null,null,null,null,"Fall2019"]
[" "," ",null,{"$f":"D86","v":"Semester Credits Earned"},{"$f":"SUM(E226:E235)","v":13},null,{"$f":"SUM(G226:G235)","v":0}]
[" "," ",null,{"$f":"D71","v":"Total Credits Earned"},{"$f":"E221+E236","v":108},null,{"$f":"G221-G236","v":120}]
[]
["Winter",{"$f":"B74+4","v":2020},{"$f":"C2","v":"Last Name, First Name"}]
["Course",{"$f":"B19","v":"Req."},{"$f":"C19","v":"Req."},"Course Title","Credits","Grade","Degree Credits","SemesterYear"]
[null,null,null,null,null,null,null,{"$f":"$A$239&$B$239","v":"Winter2020"}]
[null,null,null,null,null,null,null,{"$f":"$A$239&$B$239","v":"Winter2020"}]
[null,null,null,null,null,null,null,"Winter2020"]
[" "," ",null,{"$f":"D86","v":"Semester Credits Earned"},{"$f":"SUM(E241:E243)","v":0},null,{"$f":"SUM(G241:G243)","v":0}]
[" "," ",null,{"$f":"D71","v":"Total Credits Earned"},{"$f":"E237+E244","v":108},null,{"$f":"G237-G244","v":120}]
[]
["Spring",{"$f":"B74+4","v":2020},{"$f":"C2","v":"Last Name, First Name"}]
["Course",{"$f":"B19","v":"Req."},{"$f":"C19","v":"Req."},"Course Title","Credits","Grade","Degree Credits","SemesterYear"]
["COMP.3/4xxx-3","DSE-2",null,"Computer Science Upper-level Elective",3,null,null,{"$f":"$A$247&$B$247","v":"Spring2020"}]
["NS-3","STEM","NS-3","Natural Science Lecture",3,null,null,{"$f":"$A$247&$B$247","v":"Spring2020"}]
["NS-Lab3",null,"NS-Lab3","Natural Science Lab",1,null,null,"Spring2020"]
["SS-3","SS-3",null,"Breadth of Knowledge Requirement",3,null,null,"Spring2020"]
["FE-2","FE-2",null,"Free Elective",2,null,null,"Spring2020"]
[null,null,null,null,null,null,null,"Spring2020"]
[null,null,null,null,null,null,null,"Spring2020"]
[null,null,null,null,null,null,null,"Spring2020"]
[null,null,null,null,null,null,null,"Spring2020"]
[null,null,null,null,null,null,null,"Spring2020"]
[" "," ",null,{"$f":"D86","v":"Semester Credits Earned"},{"$f":"SUM(E249:E258)","v":12},null,{"$f":"SUM(G249:G258)","v":0}]
[" "," ",null,{"$f":"D71","v":"Total Credits Earned"},{"$f":"E245+E259","v":120},null,{"$f":"G245-G259","v":120}]
[]
["Summer",{"$f":"B74+4","v":2020},{"$f":"C2","v":"Last Name, First Name"}]
["Course",{"$f":"B19","v":"Req."},{"$f":"C19","v":"Req."},"Course Title","Credits","Grade","Degree Credits","SemesterYear"]
[null,null,null,null,null,null,null,{"$f":"$A$262&$B$262","v":"Summer2020"}]
[null,null,null,null,null,null,null,{"$f":"$A$262&$B$262","v":"Summer2020"}]
[null,null,null,null,null,null,null,"Summer2020"]
[null,null,null,null,null,null,null,"Summer2020"]
[null,null,null,null,null,null,null,"Summer2020"]
[null,null,null,null,null,null,null,"Summer2020"]
[" "," ",null,{"$f":"D86","v":"Semester Credits Earned"},{"$f":"SUM(E264:E269)","v":0},null,{"$f":"SUM(G263:G269)","v":0}]
[" "," ",null,{"$f":"D71","v":"Total Credits Earned"},{"$f":"E260+E270","v":120},null,{"$f":"G260-G270","v":120}]
[]
["Year 5"]
["Fall",{"$f":"B74+4","v":2020},{"$f":"C2","v":"Last Name, First Name"}]
["Course",{"$f":"B19","v":"Req."},{"$f":"C19","v":"Req."},"Course Title","Credits","Grade","Degree Credits","SemesterYear"]
[null,null,null,null,null,null,null,{"$f":"$A$274&$B$274","v":"Fall2020"}]
[null,null,null,null,null,null,null,{"$f":"$A$274&$B$274","v":"Fall2020"}]
[null,null,null,null,null,null,null,"Fall2020"]
[null,null,null,null,null,null,null,"Fall2020"]
[null,null,null,null,null,null,null,"Fall2020"]
[null,null,null,null,null,null,null,"Fall2020"]
[null,null,null,null,null,null,null,"Fall2020"]
[null,null,null,null,null,null,null,"Fall2020"]
[null,null,null,null,null,null,null,"Fall2020"]
[null,null,null,null,null,null,null,"Fall2020"]
[" "," ",null,{"$f":"D86","v":"Semester Credits Earned"},{"$f":"SUM(E276:E285)","v":0},null,{"$f":"SUM(G276:G285)","v":0}]
[" "," ",null,{"$f":"D71","v":"Total Credits Earned"},{"$f":"E271+E286","v":120},null,{"$f":"G271-G286","v":120}]
[]
["Winter",{"$f":"B74+5","v":2021},{"$f":"C2","v":"Last Name, First Name"}]
["Course",{"$f":"B19","v":"Req."},{"$f":"C19","v":"Req."},"Course Title","Credits","Grade","Degree Credits","SemesterYear"]
[null,null,null,null,null,null,null,{"$f":"$A$289&$B$289","v":"Winter2021"}]
[null,null,null,null,null,null,null,{"$f":"$A$289&$B$289","v":"Winter2021"}]
[null,null,null,null,null,null,null,"Winter2021"]
[" "," ",null,{"$f":"D86","v":"Semester Credits Earned"},{"$f":"SUM(E291:E293)","v":0},null,{"$f":"SUM(G291:G293)","v":0}]
[" "," ",null,{"$f":"D71","v":"Total Credits Earned"},{"$f":"E287+E294","v":120},null,{"$f":"G287-G294","v":120}]
[]
["Spring",{"$f":"B74+5","v":2021},{"$f":"C2","v":"Last Name, First Name"}]
["Course",{"$f":"B19","v":"Req."},{"$f":"C19","v":"Req."},"Course Title","Credits","Grade","Degree Credits","SemesterYear"]
[null,null,null,null,null,null,null,{"$f":"$A$297&$B$297","v":"Spring2021"}]
[null,null,null,null,null,null,null,{"$f":"$A$297&$B$297","v":"Spring2021"}]
[null,null,null,null,null,null,null,"Spring2021"]
[null,null,null,null,null,null,null,"Spring2021"]
[null,null,null,null,null,null,null,"Spring2021"]
[null,null,null,null,null,null,null,"Spring2021"]
[null,null,null,null,null,null,null,"Spring2021"]
[null,null,null,null,null,null,null,"Spring2021"]
[null,null,null,null,null,null,null,"Spring2021"]
[null,null,null,null,null,null,null,"Spring2021"]
[" "," ",null,{"$f":"D86","v":"Semester Credits Earned"},{"$f":"SUM(E299:E308)","v":0},null,{"$f":"SUM(G299:G308)","v":0}]
[" "," ",null,{"$f":"D71","v":"Total Credits Earned"},{"$f":"E295+E309","v":120},null,{"$f":"G295-G309","v":120}]
[]
["Summer",{"$f":"B74+5","v":2021},{"$f":"C2","v":"Last Name, First Name"}]
["Course",{"$f":"B19","v":"Req."},{"$f":"C19","v":"Req."},"Course Title","Credits","Grade","Degree Credits","SemesterYear"]
[null,null,null,null,null,null,null,{"$f":"$A$312&$B$312","v":"Summer2021"}]
[null,null,null,null,null,null,null,{"$f":"$A$312&$B$312","v":"Summer2021"}]
[null,null,null,null,null,null,null,"Summer2021"]
[null,null,null,null,null,null,null,"Summer2021"]
[null,null,null,null,null,null,null,"Summer2021"]
[null,null,null,null,null,null,null,"Summer2021"]
[" "," ",null,{"$f":"D86","v":"Semester Credits Earned"},{"$f":"SUM(E314:E319)","v":0},null,{"$f":"SUM(G313:G319)","v":0}]
[" "," ",null,{"$f":"D71","v":"Total Credits Earned"},{"$f":"E310+E320","v":120},null,{"$f":"G310-G320","v":120}]
[]
["Year 6"]
["Fall",{"$f":"B74+5","v":2021},{"$f":"C2","v":"Last Name, First Name"}]
["Course",{"$f":"B19","v":"Req."},{"$f":"C19","v":"Req."},"Course Title","Credits","Grade","Degree Credits","SemesterYear"]
[null,null,null,null,null,null,null,{"$f":"$A$324&$B$324","v":"Fall2021"}]
[null,null,null,null,null,null,null,{"$f":"$A$324&$B$324","v":"Fall2021"}]
[null,null,null,null,null,null,null,"Fall2021"]
[null,null,null,null,null,null,null,"Fall2021"]
[null,null,null,null,null,null,null,"Fall2021"]
[null,null,null,null,null,null,null,"Fall2021"]
[null,null,null,null,null,null,null,"Fall2021"]
[null,null,null,null,null,null,null,"Fall2021"]
[null,null,null,null,null,null,null,"Fall2021"]
[null,null,null,null,null,null,null,"Fall2021"]
[" "," ",null,{"$f":"D136","v":"Semester Credits Earned"},{"$f":"SUM(E326:E335)","v":0},null,{"$f":"SUM(G326:G335)","v":0}]
[" "," ",null,{"$f":"D121","v":"Total Credits Earned"},{"$f":"E321+E336","v":120},null,{"$f":"G321-G336","v":120}]
[]
["Winter",{"$f":"B74+6","v":2022},{"$f":"C2","v":"Last Name, First Name"}]
["Course",{"$f":"B19","v":"Req."},{"$f":"C19","v":"Req."},"Course Title","Credits","Grade","Degree Credits","SemesterYear"]
[null,null,null,null,null,null,null,{"$f":"$A$339&$B$339","v":"Winter2022"}]
[null,null,null,null,null,null,null,{"$f":"$A$339&$B$339","v":"Winter2022"}]
[null,null,null,null,null,null,null,"Winter2022"]
[" "," ",null,{"$f":"D136","v":"Semester Credits Earned"},{"$f":"SUM(E341:E343)","v":0},null,{"$f":"SUM(G341:G343)","v":0}]
[" "," ",null,{"$f":"D121","v":"Total Credits Earned"},{"$f":"E337+E344","v":120},null,{"$f":"G337-G344","v":120}]
[]
["Spring",{"$f":"B74+6","v":2022},{"$f":"C2","v":"Last Name, First Name"}]
["Course",{"$f":"B19","v":"Req."},{"$f":"C19","v":"Req."},"Course Title","Credits","Grade","Degree Credits","SemesterYear"]
[null,null,null,null,null,null,null,{"$f":"$A$347&$B$347","v":"Spring2022"}]
[null,null,null,null,null,null,null,{"$f":"$A$347&$B$347","v":"Spring2022"}]
[null,null,null,null,null,null,null,"Spring2022"]
[null,null,null,null,null,null,null,"Spring2022"]
[null,null,null,null,null,null,null,"Spring2022"]
[null,null,null,null,null,null,null,"Spring2022"]
[null,null,null,null,null,null,null,"Spring2022"]
[null,null,null,null,null,null,null,"Spring2022"]
[null,null,null,null,null,null,null,"Spring2022"]
[null,null,null,null,null,null,null,"Spring2022"]
[" "," ",null,{"$f":"D136","v":"Semester Credits Earned"},{"$f":"SUM(E349:E358)","v":0},null,{"$f":"SUM(G349:G358)","v":0}]
[" "," ",null,{"$f":"D121","v":"Total Credits Earned"},{"$f":"E345+E359","v":120},null,{"$f":"G345-G359","v":120}]
[]
["Summer",{"$f":"B74+6","v":2022},{"$f":"C2","v":"Last Name, First Name"}]
["Course",{"$f":"B19","v":"Req."},{"$f":"C19","v":"Req."},"Course Title","Credits","Grade","Degree Credits","SemesterYear"]
[null,null,null,null,null,null,null,{"$f":"$A$362&$B$362","v":"Summer2022"}]
[null,null,null,null,null,null,null,{"$f":"$A$362&$B$362","v":"Summer2022"}]
[null,null,null,null,null,null,null,"Summer2022"]
[null,null,null,null,null,null,null,"Summer2022"]
[null,null,null,null,null,null,null,"Summer2022"]
[null,null,null,null,null,null,null,"Summer2022"]
[" "," ",null,{"$f":"D136","v":"Semester Credits Earned"},{"$f":"SUM(E364:E369)","v":0},null,{"$f":"SUM(G363:G369)","v":0}]
[" "," ",null,{"$f":"D121","v":"Total Credits Earned"},{"$f":"E360+E370","v":120},null,{"$f":"G360-G370","v":120}]
[]
[]
[null,"Graduation Plan Review & Approval"]
[]
[null," "]
[]
[null,"Initial Review: OASiS",null,null,"Date"]
[]
[]
[]
[null,"Additional Review: Faculty Mentor",null,null,"Date"]
[]
[null," ",null,null," "]
[]
[null,"Secondary Major Review",null,null,"Date"]
[]
[null," ",null,null," "]
[]
[null,"Final Review: OASiS Approval",null,null,"Date"]
[]
[null," ",null,null," "]
[]
[null,{"$f":"C2","v":"Last Name, First Name"},null,null,"Date"]
[]
[]
[]
[]
[null,"OASiS Comments"]

{"sheet":"Sample_Checklist_Data Science","index":4,"n_rows":116,"n_cols":13,"rows_kept":116,"cut":false,"hidden":true,"merged":[[29,0,29,8],[0,0,0,8],[0,11,0,12],[1,0,1,2],[1,4,1,6],[1,11,1,12],[2,0,2,8],[18,0,18,8],[23,0,23,8],[27,0,27,8],[28,0,28,2],[28,4,28,6],[41,0,41,8],[41,11,41,12],[42,0,42,2],[42,4,42,6],[42,11,42,12],[56,11,56,12],[57,0,57,2],[57,4,57,6],[57,11,57,12],[65,0,65,8],[65,11,65,12],[85,11,85,12],[86,0,86,2],[86,4,86,6],[86,11,86,12],[66,0,66,2],[66,4,66,6],[66,11,66,12],[67,11,67,12],[77,0,77,8],[78,0,78,2],[78,4,78,6],[108,0,108,8],[109,0,109,8],[111,0,111,8],[21,0,21,8],[87,0,87,8],[90,0,90,8],[92,0,92,8],[96,0,96,8],[100,0,100,8],[105,0,105,8],[81,0,81,8],[82,0,82,2],[82,4,82,6],[85,0,85,8],[56,0,56,8],[31,0,31,8]]}
["Checklist - Data Science",null,null,null,null,null,null,null,null,null,"Sample_Plan_Data_Science","Required Data Science Electives"]
["Requirement",null,null,"Credits","Taken",null,null,"Semester","Credits",null,null,"List courses you are interested in possibly taking. (NOTE: This is not required.)"]
["Required Computer Science Courses",null,null,null,null,null,null,null,null,null,null,"Course","Title"]
["COMP.1010","or","91.101",3,"COMP.1010","or","91.101",{"$f":"IF(AND(ISNA(VLOOKUP(E4,INDIRECT(\"'\"&$K$1&\"'!$A$1:$H$550\"),8,FALSE)), ISNA(VLOOKUP(G4,INDIRECT(\"'\"&$K$1&\"'!$A$1:$H$550\"),8,FALSE))), \"Not Found\", (IF(ISNA(VLOOKUP(E4,INDIRECT(\"'\"&$K$1&\"'!$A$1:$H$550\"),8,FALSE)), VLOOKUP(G4,INDIRECT(\"'\"&$K$1&\"'!$A$1:$H$550\"),8,FALSE), VLOOKUP(E4,INDIRECT(\"'\"&$K$1&\"'!$A$1:$H$550\"),8,FALSE))))","v":"Fall2016"},{"$f":"IF(AND(ISNA(VLOOKUP(E4,INDIRECT(\"'\"&$K$1&\"'!$A$1:$H$550\"),5,FALSE)), ISNA(VLOOKUP(G4,INDIRECT(\"'\"&$K$1&\"'!$A$1:$H$550\"),5,FALSE))), \"0\", (IF(ISNA(VLOOKUP(E4,INDIRECT(\"'\"&$K$1&\"'!$A$1:$H$550\"),5,FALSE)), VLOOKUP(G4,INDIRECT(\"'\"&$K$1&\"'!$A$1:$H$550\"),5,FALSE), VLOOKUP(E4,INDIRECT(\"'\"&$K$1&\"'!$A$1:$H$550\"),5,FALSE))))","v":3}]
["COMP.1030L","or","91.103",1,"COMP.1030L","or","91.103",{"$f":"IF(AND(ISNA(VLOOKUP(E5,INDIRECT(\"'\"&$K$1&\"'!$A$1:$H$550\"),8,FALSE)), ISNA(VLOOKUP(G5,INDIRECT(\"'\"&$K$1&\"'!$A$1:$H$550\"),8,FALSE))), \"Not Found\", (IF(ISNA(VLOOKUP(E5,INDIRECT(\"'\"&$K$1&\"'!$A$1:$H$550\"),8,FALSE)), VLOOKUP(G5,INDIRECT(\"'\"&$K$1&\"'!$A$1:$H$550\"),8,FALSE), VLOOKUP(E5,INDIRECT(\"'\"&$K$1&\"'!$A$1:$H$550\"),8,FALSE))))","v":"Fall2016"},1]
["COMP.1020","or","91.102",3,"COMP.1020","or","91.102","Spring2017",{"$f":"IF(AND(ISNA(VLOOKUP(E6,INDIRECT(\"'\"&$K$1&\"'!$A$1:$H$550\"),5,FALSE)), ISNA(VLOOKUP(G6,INDIRECT(\"'\"&$K$1&\"'!$A$1:$H$550\"),5,FALSE))), \"0\", (IF(ISNA(VLOOKUP(E6,INDIRECT(\"'\"&$K$1&\"'!$A$1:$H$550\"),5,FALSE)), VLOOKUP(G6,INDIRECT(\"'\"&$K$1&\"'!$A$1:$H$550\"),5,FALSE), VLOOKUP(E6,INDIRECT(\"'\"&$K$1&\"'!$A$1:$H$550\"),5,FALSE))))","v":3}]
["COMP.1040L","or","91.104",1,"COMP.1040L","or","91.104","Spring2017",{"$f":"IF(AND(ISNA(VLOOKUP(E7,INDIRECT(\"'\"&$K$1&\"'!$A$1:$H$550\"),5,FALSE)), ISNA(VLOOKUP(G7,INDIRECT(\"'\"&$K$1&\"'!$A$1:$H$550\"),5,FALSE))), \"0\", (IF(ISNA(VLOOKUP(E7,INDIRECT(\"'\"&$K$1&\"'!$A$1:$H$550\"),5,FALSE)), VLOOKUP(G7,INDIRECT(\"'\"&$K$1&\"'!$A$1:$H$550\"),5,FALSE), VLOOKUP(E7,INDIRECT(\"'\"&$K$1&\"'!$A$1:$H$550\"),5,FALSE))))","v":1}]
["COMP.2010","or","91.201",3,"COMP.2010","or","91.201","Fall2017",3]
["COMP.2010L",null,null,1,"COMP.2010L",null,null,{"$f":"IF(AND(ISNA(VLOOKUP(E9,INDIRECT(\"'\"&$K$1&\"'!$A$1:$H$550\"),8,FALSE)), ISNA(VLOOKUP(G9,INDIRECT(\"'\"&$K$1&\"'!$A$1:$H$550\"),8,FALSE))), \"Not Found\", (IF(ISNA(VLOOKUP(E9,INDIRECT(\"'\"&$K$1&\"'!$A$1:$H$550\"),8,FALSE)), VLOOKUP(G9,INDIRECT(\"'\"&$K$1&\"'!$A$1:$H$550\"),8,FALSE), VLOOKUP(E9,INDIRECT(\"'\"&$K$1&\"'!$A$1:$H$550\"),8,FALSE))))","v":"Fall2017"},{"$f":"IF(AND(ISNA(VLOOKUP(E9,INDIRECT(\"'\"&$K$1&\"'!$A$1:$H$550\"),5,FALSE)), ISNA(VLOOKUP(G9,INDIRECT(\"'\"&$K$1&\"'!$A$1:$H$550\"),5,FALSE))), \"0\", (IF(ISNA(VLOOKUP(E9,INDIRECT(\"'\"&$K$1&\"'!$A$1:$H$550\"),5,FALSE)), VLOOKUP(G9,INDIRECT(\"'\"&$K$1&\"'!$A$1:$H$550\"),5,FALSE), VLOOKUP(E9,INDIRECT(\"'\"&$K$1&\"'!$A$1:$H$550\"),5,FALSE))))","v":1}]
["COMP.2030","or","91.203",3,"COMP.2030","or","91.203","Fall2017",3]
["COMP.2030L",null,null,1,"COMP.2030L",null,null,{"$f":"IF(AND(ISNA(VLOOKUP(E11,INDIRECT(\"'\"&$K$1&\"'!$A$1:$H$550\"),8,FALSE)), ISNA(VLOOKUP(G11,INDIRECT(\"'\"&$K$1&\"'!$A$1:$H$550\"),8,FALSE))), \"Not Found\", (IF(ISNA(VLOOKUP(E11,INDIRECT(\"'\"&$K$1&\"'!$A$1:$H$550\"),8,FALSE)), VLOOKUP(G11,INDIRECT(\"'\"&$K$1&\"'!$A$1:$H$550\"),8,FALSE), VLOOKUP(E11,INDIRECT(\"'\"&$K$1&\"'!$A$1:$H$550\"),8,FALSE))))","v":"Fall2017"},{"$f":"IF(AND(ISNA(VLOOKUP(E11,INDIRECT(\"'\"&$K$1&\"'!$A$1:$H$550\"),5,FALSE)), ISNA(VLOOKUP(G11,INDIRECT(\"'\"&$K$1&\"'!$A$1:$H$550\"),5,FALSE))), \"0\", (IF(ISNA(VLOOKUP(E11,INDIRECT(\"'\"&$K$1&\"'!$A$1:$H$550\"),5,FALSE)), VLOOKUP(G11,INDIRECT(\"'\"&$K$1&\"'!$A$1:$H$550\"),5,FALSE), VLOOKUP(E11,INDIRECT(\"'\"&$K$1&\"'!$A$1:$H$550\"),5,FALSE))))","v":1}]
["COMP.2040","or","91.204",3,"COMP.2040","or","91.204","Spring2018",3]
["COMP.3010","or","91.301",3,"COMP.3010","or","91.301","Spring2019",3]
["COMP.3040","or","91.304",3,"COMP.3040","or","91.304","Fall2018",3]
["COMP.3050","or","91.305",3,"COMP.3050","or","91.305","Fall2018",3]
["COMP.3080","or","91.308",3,"COMP.3080","or","91.308","Spring2019",3]
["COMP.4040","or","91.404",3,"COMP.4040","or","91.404","Fall2019",3]
["COMP.4220","or","91.422",3,"COMP.4220","or","91.4220",{"$f":"IF(AND(ISNA(VLOOKUP(E18,INDIRECT(\"'\"&$K$1&\"'!$A$1:$H$550\"),8,FALSE)), ISNA(VLOOKUP(G18,INDIRECT(\"'\"&$K$1&\"'!$A$1:$H$550\"),8,FALSE))), \"Not Found\", (IF(ISNA(VLOOKUP(E18,INDIRECT(\"'\"&$K$1&\"'!$A$1:$H$550\"),8,FALSE)), VLOOKUP(G18,INDIRECT(\"'\"&$K$1&\"'!$A$1:$H$550\"),8,FALSE), VLOOKUP(E18,INDIRECT(\"'\"&$K$1&\"'!$A$1:$H$550\"),8,FALSE))))","v":"Spring2019"},{"$f":"IF(AND(ISNA(VLOOKUP(E18,INDIRECT(\"'\"&$K$1&\"'!$A$1:$H$550\"),5,FALSE)), ISNA(VLOOKUP(G18,INDIRECT(\"'\"&$K$1&\"'!$A$1:$H$550\"),5,FALSE))), \"0\", (IF(ISNA(VLOOKUP(E18,INDIRECT(\"'\"&$K$1&\"'!$A$1:$H$550\"),5,FALSE)), VLOOKUP(G18,INDIRECT(\"'\"&$K$1&\"'!$A$1:$H$550\"),5,FALSE), VLOOKUP(E18,INDIRECT(\"'\"&$K$1&\"'!$A$1:$H$550\"),5,FALSE))))","v":3}]
["Upper Level Data Science Elective"]
["DSE-1",null,null,3,{"$f":"IF(ISNA(INDEX(INDIRECT(\"'\"&$K$1&\"'!$A$1:$A$550\"), MATCH(A20,INDIRECT(\"'\"&$K$1&\"'!$B$1:$B$550\"),0))), \"Not Found\", (INDEX(INDIRECT(\"'\"&$K$1&\"'!$A$1:$A$550\"), MATCH(A20,INDIRECT(\"'\"&$K$1&\"'!$B$1:$B$550\"),0))))","v":"COMP.3/4xxx-1"},null,null,{"$f":"IF(ISNA(VLOOKUP(E20,INDIRECT(\"'\"&$K$1&\"'!$A$1:$H$550\"),8,FALSE)), \"Not Found\", VLOOKUP(E20,INDIRECT(\"'\"&$K$1&\"'!$A$1:$H$550\"),8,FALSE))","v":"Fall2019"},{"$f":"IF(ISNA(VLOOKUP(E20,INDIRECT(\"'\"&$K$1&\"'!$A$1:$H$550\"),5,FALSE)), \"0\", VLOOKUP(E20,INDIRECT(\"'\"&$K$1&\"'!$A$1:$H$550\"),5,FALSE))","v":3}]
["DSE-2",null,null,3,"COMP.3/4xxx-3",null,null,"Spring2020",3]
["General CS Upper Level Elective"]
["CSE-1",null,null,3,"COMP.3/4xxx-2",null,null,{"$f":"IF(ISNA(VLOOKUP(E23,INDIRECT(\"'\"&$K$1&\"'!$A$1:$H$550\"),8,FALSE)), \"Not Found\", VLOOKUP(E23,INDIRECT(\"'\"&$K$1&\"'!$A$1:$H$550\"),8,FALSE))","v":"Fall2019"},{"$f":"IF(ISNA(VLOOKUP(E23,INDIRECT(\"'\"&$K$1&\"'!$A$1:$H$550\"),5,FALSE)), \"0\", VLOOKUP(E23,INDIRECT(\"'\"&$K$1&\"'!$A$1:$H$550\"),5,FALSE))","v":3}]
["CS Project Course"]
["Sr.Prj-1",null,null,3,{"$f":"IF(ISNA(INDEX(INDIRECT(\"'\"&$K$1&\"'!$A$1:$A$550\"), MATCH(A25,INDIRECT(\"'\"&$K$1&\"'!$C$1:$C$550\"),0))), \"Not Found\", (INDEX(INDIRECT(\"'\"&$K$1&\"'!$A$1:$A$550\"), MATCH(A25,INDIRECT(\"'\"&$K$1&\"'!$C$1:$C$550\"),0))))","v":"COMP.4220"},null,null,{"$f":"IF(ISNA(VLOOKUP(E25,INDIRECT(\"'\"&$K$1&\"'!$A$1:$H$550\"),8,FALSE)), \"Not Found\", VLOOKUP(E25,INDIRECT(\"'\"&$K$1&\"'!$A$1:$H$550\"),8,FALSE))","v":"Spring2019"},{"$f":"IF(ISNA(VLOOKUP(E25,INDIRECT(\"'\"&$K$1&\"'!$A$1:$H$550\"),5,FALSE)), \"0\", VLOOKUP(E25,INDIRECT(\"'\"&$K$1&\"'!$A$1:$H$550\"),5,FALSE))","v":3}]
["Sr.Prj-2",null,null,3,{"$f":"IF(ISNA(INDEX(INDIRECT(\"'\"&$K$1&\"'!$A$1:$A$550\"), MATCH(A26,INDIRECT(\"'\"&$K$1&\"'!$C$1:$C$550\"),0))), \"Not Found\", (INDEX(INDIRECT(\"'\"&$K$1&\"'!$A$1:$A$550\"), MATCH(A26,INDIRECT(\"'\"&$K$1&\"'!$C$1:$C$550\"),0))))","v":"COMP.3/4xxx-1"},null,null,{"$f":"IF(ISNA(VLOOKUP(E26,INDIRECT(\"'\"&$K$1&\"'!$A$1:$H$550\"),8,FALSE)), \"Not Found\", VLOOKUP(E26,INDIRECT(\"'\"&$K$1&\"'!$A$1:$H$550\"),8,FALSE))","v":"Fall2019"},{"$f":"IF(ISNA(VLOOKUP(E26,INDIRECT(\"'\"&$K$1&\"'!$A$1:$H$550\"),5,FALSE)), \"0\", VLOOKUP(E26,INDIRECT(\"'\"&$K$1&\"'!$A$1:$H$550\"),5,FALSE))","v":3}]
[]
["Required Supporting Technical Course"]
["Requirement",null,null,"Credits","Taken",null,null,"Semester","Credits"]
["Electrical Engineering"]
["EECE.2650","or","16.265",3,"EECE.2650","or","16.265",{"$f":"IF(AND(ISNA(VLOOKUP(E31,INDIRECT(\"'\"&$K$1&\"'!$A$1:$H$550\"),8,FALSE)), ISNA(VLOOKUP(G31,INDIRECT(\"'\"&$K$1&\"'!$A$1:$H$550\"),8,FALSE))), \"Not Found\", (IF(ISNA(VLOOKUP(E31,INDIRECT(\"'\"&$K$1&\"'!$A$1:$H$550\"),8,FALSE)), VLOOKUP(G31,INDIRECT(\"'\"&$K$1&\"'!$A$1:$H$550\"),8,FALSE), VLOOKUP(E31,INDIRECT(\"'\"&$K$1&\"'!$A$1:$H$550\"),8,FALSE))))","v":"Fall2017"},{"$f":"IF(AND(ISNA(VLOOKUP(E31,INDIRECT(\"'\"&$K$1&\"'!$A$1:$H$550\"),5,FALSE)), ISNA(VLOOKUP(G31,INDIRECT(\"'\"&$K$1&\"'!$A$1:$H$550\"),5,FALSE))), \"0\", (IF(ISNA(VLOOKUP(E31,INDIRECT(\"'\"&$K$1&\"'!$A$1:$H$550\"),5,FALSE)), VLOOKUP(G31,INDIRECT(\"'\"&$K$1&\"'!$A$1:$H$550\"),5,FALSE), VLOOKUP(E31,INDIRECT(\"'\"&$K$1&\"'!$A$1:$H$550\"),5,FALSE))))","v":3}]
["Mathematics"]
["MATH.1310","or","92.131",4,"MATH.1310","or","92.131",{"$f":"IF(AND(ISNA(VLOOKUP(E33,INDIRECT(\"'\"&$K$1&\"'!$A$1:$H$550\"),8,FALSE)), ISNA(VLOOKUP(G33,INDIRECT(\"'\"&$K$1&\"'!$A$1:$H$550\"),8,FALSE))), \"Not Found\", (IF(ISNA(VLOOKUP(E33,INDIRECT(\"'\"&$K$1&\"'!$A$1:$H$550\"),8,FALSE)), VLOOKUP(G33,INDIRECT(\"'\"&$K$1&\"'!$A$1:$H$550\"),8,FALSE), VLOOKUP(E33,INDIRECT(\"'\"&$K$1&\"'!$A$1:$H$550\"),8,FALSE))))","v":"Fall2016"},{"$f":"IF(AND(ISNA(VLOOKUP(E33,INDIRECT(\"'\"&$K$1&\"'!$A$1:$H$550\"),5,FALSE)), ISNA(VLOOKUP(G33,INDIRECT(\"'\"&$K$1&\"'!$A$1:$H$550\"),5,FALSE))), \"0\", (IF(ISNA(VLOOKUP(E33,INDIRECT(\"'\"&$K$1&\"'!$A$1:$H$550\"),5,FALSE)), VLOOKUP(G33,INDIRECT(\"'\"&$K$1&\"'!$A$1:$H$550\"),5,FALSE), VLOOKUP(E33,INDIRECT(\"'\"&$K$1&\"'!$A$1:$H$550\"),5,FALSE))))","v":4}]
["MATH.1320","or","92.132",4,"MATH.1320","or","92.132","Spring2017",4]
["MATH.2210","or","92.221",3,"MATH.2210","or","92.221",{"$f":"IF(AND(ISNA(VLOOKUP(E35,INDIRECT(\"'\"&$K$1&\"'!$A$1:$H$550\"),8,FALSE)), ISNA(VLOOKUP(G35,INDIRECT(\"'\"&$K$1&\"'!$A$1:$H$550\"),8,FALSE))), \"Not Found\", (IF(ISNA(VLOOKUP(E35,INDIRECT(\"'\"&$K$1&\"'!$A$1:$H$550\"),8,FALSE)), VLOOKUP(G35,INDIRECT(\"'\"&$K$1&\"'!$A$1:$H$550\"),8,FALSE), VLOOKUP(E35,INDIRECT(\"'\"&$K$1&\"'!$A$1:$H$550\"),8,FALSE))))","v":"Fall2017"},{"$f":"IF(AND(ISNA(VLOOKUP(E35,INDIRECT(\"'\"&$K$1&\"'!$A$1:$H$550\"),5,FALSE)), ISNA(VLOOKUP(G35,INDIRECT(\"'\"&$K$1&\"'!$A$1:$H$550\"),5,FALSE))), \"0\", (IF(ISNA(VLOOKUP(E35,INDIRECT(\"'\"&$K$1&\"'!$A$1:$H$550\"),5,FALSE)), VLOOKUP(G35,INDIRECT(\"'\"&$K$1&\"'!$A$1:$H$550\"),5,FALSE), VLOOKUP(E35,INDIRECT(\"'\"&$K$1&\"'!$A$1:$H$550\"),5,FALSE))))","v":3}]
["MATH.2220","or","92.222",3,"MATH.2220","or","92.222","Spring2018",3]
["MATH.2310","or","92.231",4,"MATH.2310","or","92.231","Fall2018",4]
["MATH.3210","or","92.321",3,"MATH.3210","or","92.321","Fall2017",3]
["MATH.3220","or","92.322",3,"MATH.3220","or","92.322","Spring2018",3]
["MATH.3860","or","92.386",3,"MATH.3860","or","92.386","Spring2018",3]
[]
["Natural Science Electives",null,null,null,null,null,null,null,null,null,null,"Natural Science Electives"]
["Requirement",null,null,"Credits","Taken",null,null,"Semester","Credits",null,null,"List courses you are interested in possibly taking to satisfy this requirement"]
["NS-1",null,null,3,{"$f":"IF(ISNA(INDEX(INDIRECT(\"'\"&$K$1&\"'!$A$1:$A$550\"), MATCH(A44,INDIRECT(\"'\"&$K$1&\"'!$C$1:$C$550\"),0))), \"Not Found\", (INDEX(INDIRECT(\"'\"&$K$1&\"'!$A$1:$A$550\"), MATCH(A44,INDIRECT(\"'\"&$K$1&\"'!$C$1:$C$550\"),0))))","v":"NS-1"},null,null,{"$f":"IF(ISNA(VLOOKUP(E44,INDIRECT(\"'\"&$K$1&\"'!$A$1:$H$550\"),8,FALSE)), \"Not Found\", VLOOKUP(E44,INDIRECT(\"'\"&$K$1&\"'!$A$1:$H$550\"),8,FALSE))","v":"Spring2017"},{"$f":"IF(ISNA(VLOOKUP(E44,INDIRECT(\"'\"&$K$1&\"'!$A$1:$H$550\"),5,FALSE)), \"0\", VLOOKUP(E44,INDIRECT(\"'\"&$K$1&\"'!$A$1:$H$550\"),5,FALSE))","v":3},null,null,"Course","Title"]
["NS-Lab1",null,null,1,{"$f":"IF(ISNA(INDEX(INDIRECT(\"'\"&$K$1&\"'!$A$1:$A$550\"), MATCH(A45,INDIRECT(\"'\"&$K$1&\"'!$C$1:$C$550\"),0))), \"Not Found\", (INDEX(INDIRECT(\"'\"&$K$1&\"'!$A$1:$A$550\"), MATCH(A45,INDIRECT(\"'\"&$K$1&\"'!$C$1:$C$550\"),0))))","v":"NS-Lab1"},null,null,"Spring2017",1]
["NS-2",null,null,3,"NS-2",null,null,"Fall2019",3]
["NS-Lab2",null,null,1,"NS-Lab2",null,null,"Fall2019",1]
["NS-3",null,null,3,"NS-3",null,null,"Spring2020",3]
["NS-Lab3",null,null,1,"NS-Lab3",null,null,"Spring2020",1]
["Not Req.",null,null,"n/a","Not Found",null,null,"Not Found","0"]
["Not Req.",null,null,"n/a","Not Found",null,null,"Not Found","0"]
[]
[]
[]
[]
[]
["Technical Elective",null,null,null,null,null,null,null,null,null,null,"Technical Elective"]
["Requirement",null,null,"Credits","Taken",null,null,"Semester","Credits",null,null,"List courses you are interested in possibly taking to satisfy this requirement"]
["TE-1",null,null,3,{"$f":"IF(ISNA(INDEX(INDIRECT(\"'\"&$K$1&\"'!$A$1:$A$550\"), MATCH(A59,INDIRECT(\"'\"&$K$1&\"'!$B$1:$B$550\"),0))), \"Not Found\", (INDEX(INDIRECT(\"'\"&$K$1&\"'!$A$1:$A$550\"), MATCH(A59,INDIRECT(\"'\"&$K$1&\"'!$B$1:$B$550\"),0))))","v":"TE-1"},null,null,{"$f":"IF(ISNA(VLOOKUP(E59,INDIRECT(\"'\"&$K$1&\"'!$A$1:$H$550\"),8,FALSE)), \"Not Found\", VLOOKUP(E59,INDIRECT(\"'\"&$K$1&\"'!$A$1:$H$550\"),8,FALSE))","v":"Spring2019"},{"$f":"IF(ISNA(VLOOKUP(E59,INDIRECT(\"'\"&$K$1&\"'!$A$1:$H$550\"),5,FALSE)), \"0\", VLOOKUP(E59,INDIRECT(\"'\"&$K$1&\"'!$A$1:$H$550\"),5,FALSE))","v":3},null,null,"Course","Title"]
["Not Req.",null,null,"n/a","Not Found",null,null,"Not Found","0"]
[]
[]
[]
[]
[]
["Free Electives (FE)",null,null,null,null,null,null,null,null,null,null,"Free Electives"]
["Requirement",null,null,"Credits","Taken",null,null,"Semester","Credits",null,null,"List free electives you are interested in taking.  These cannot be below the level of a"]
["FE-1",null,null,3,{"$f":"IF(ISNA(INDEX(INDIRECT(\"'\"&$K$1&\"'!$A$1:$A$550\"), MATCH(\"*\"&A68&\"*\",INDIRECT(\"'\"&$K$1&\"'!$B$1:$B$550\"),0))), \"Not Found\", (INDEX(INDIRECT(\"'\"&$K$1&\"'!$A$1:$A$550\"), MATCH(\"*\"&A68&\"*\",INDIRECT(\"'\"&$K$1&\"'!$B$1:$B$550\"),0))))","v":"FE-1"},null,null,{"$f":"IF(ISNA(VLOOKUP(E68,INDIRECT(\"'\"&$K$1&\"'!$A$1:$H$550\"),8,FALSE)), \"Not Found\", VLOOKUP(E68,INDIRECT(\"'\"&$K$1&\"'!$A$1:$H$550\"),8,FALSE))","v":"Fall2018"},{"$f":"IF(ISNA(VLOOKUP(E68,INDIRECT(\"'\"&$K$1&\"'!$A$1:$H$550\"),5,FALSE)), \"0\", VLOOKUP(E68,INDIRECT(\"'\"&$K$1&\"'!$A$1:$H$550\"),5,FALSE))","v":3},null,null,"required course.  Specific courses may be recommended for different CS tracks."]
["FE-2",null,null,2,"FE-2",null,null,"Spring2020",2]
["Not Req.",null,null,"n/a","Not Found",null,null,"Not Found","0"]
["Not Req.",null,null,"n/a","Not Found",null,null,"Not Found","0"]
["Not Req.",null,null,"n/a","Not Found",null,null,"Not Found","0"]
["Not Req.",null,null,"n/a","Not Found",null,null,"Not Found","0"]
[]
["Required FE Credits",null,null,null,null,null,null,"Projected Credits"]
[null,null,null,{"$f":"120-SUM(D4:D23, D31:D59:D60, D89:D90,D94:D100)","v":5},null,null,null,null,{"$f":"SUM(I68:I74)","v":5}]
[]
["Oral & Written Communication"]
["Requirement",null,null,"Credits","Taken",null,null,"Semester","Credits"]
["ENGL.2200","or","42.220",3,"ENGL.2200","or","42.220",{"$f":"IF(AND(ISNA(VLOOKUP(E80,INDIRECT(\"'\"&$K$1&\"'!$A$1:$H$550\"),8,FALSE)), ISNA(VLOOKUP(G80,INDIRECT(\"'\"&$K$1&\"'!$A$1:$H$550\"),8,FALSE))), \"Not Found\", (IF(ISNA(VLOOKUP(E80,INDIRECT(\"'\"&$K$1&\"'!$A$1:$H$550\"),8,FALSE)), VLOOKUP(G80,INDIRECT(\"'\"&$K$1&\"'!$A$1:$H$550\"),8,FALSE), VLOOKUP(E80,INDIRECT(\"'\"&$K$1&\"'!$A$1:$H$550\"),8,FALSE))))","v":"Fall2018"},{"$f":"IF(AND(ISNA(VLOOKUP(E80,INDIRECT(\"'\"&$K$1&\"'!$A$1:$H$550\"),5,FALSE)), ISNA(VLOOKUP(G80,INDIRECT(\"'\"&$K$1&\"'!$A$1:$H$550\"),5,FALSE))), \"0\", (IF(ISNA(VLOOKUP(E80,INDIRECT(\"'\"&$K$1&\"'!$A$1:$H$550\"),5,FALSE)), VLOOKUP(G80,INDIRECT(\"'\"&$K$1&\"'!$A$1:$H$550\"),5,FALSE), VLOOKUP(E80,INDIRECT(\"'\"&$K$1&\"'!$A$1:$H$550\"),5,FALSE))))","v":3}]
[]
["CS Ethics Requirement"]
["Requirement",null,null,"Credits","Taken",null,null,"Semester","Credits"]
["CSET",null,null,3,{"$f":"IF(ISNA(INDEX(INDIRECT(\"'\"&$K$1&\"'!$A$1:$A$550\"), MATCH(A84,INDIRECT(\"'\"&$K$1&\"'!$C$1:$C$550\"),0))), \"Not Found\", (INDEX(INDIRECT(\"'\"&$K$1&\"'!$A$1:$A$550\"), MATCH(A84,INDIRECT(\"'\"&$K$1&\"'!$C$1:$C$550\"),0))))","v":"AH-2"},null,null,{"$f":"IF(ISNA(VLOOKUP(E84,INDIRECT(\"'\"&$K$1&\"'!$A$1:$H$550\"),8,FALSE)), \"Not Found\", VLOOKUP(E84,INDIRECT(\"'\"&$K$1&\"'!$A$1:$H$550\"),8,FALSE))","v":"Spring2018"},{"$f":"IF(ISNA(VLOOKUP(E84,INDIRECT(\"'\"&$K$1&\"'!$A$1:$H$550\"),5,FALSE)), \"0\", VLOOKUP(E84,INDIRECT(\"'\"&$K$1&\"'!$A$1:$H$550\"),5,FALSE))","v":3}]
[]
["Breadth of Knowledge",null,null,null,null,null,null,null,null,null,null," Breadth of Knowledge Requirements"]
["Requirement",null,null,"Credits","Taken",null,null,"Semester","Credits",null,null,"Select courses you are interested in taking to satisfy this Requirements."]
["College Writing",null,null,null,null,null,null,null,null,null,null,"Area","Title"]
["CW-1",null,null,3,{"$f":"IF(ISNA(INDEX(INDIRECT(\"'\"&$K$1&\"'!$A$1:$A$550\"), MATCH(A89,INDIRECT(\"'\"&$K$1&\"'!$B$1:$B$550\"),0))), \"Not Found\", (INDEX(INDIRECT(\"'\"&$K$1&\"'!$A$1:$A$550\"), MATCH(A89,INDIRECT(\"'\"&$K$1&\"'!$B$1:$B$550\"),0))))","v":"ENGL.1010"},null,null,{"$f":"IF(ISNA(VLOOKUP(E89,INDIRECT(\"'\"&$K$1&\"'!$A$1:$H$550\"),8,FALSE)), \"Not Found\", VLOOKUP(E89,INDIRECT(\"'\"&$K$1&\"'!$A$1:$H$550\"),8,FALSE))","v":"Transfer/AP"},{"$f":"IF(ISNA(VLOOKUP(E89,INDIRECT(\"'\"&$K$1&\"'!$A$1:$H$550\"),5,FALSE)), \"0\", VLOOKUP(E89,INDIRECT(\"'\"&$K$1&\"'!$A$1:$H$550\"),5,FALSE))","v":3}]
["CW-2",null,null,3,"ENGL.1020",null,null,"Fall2016",3]
["Mathematics"]
["MA",null,null,4,{"$f":"IF(ISNA(INDEX(INDIRECT(\"'\"&$K$1&\"'!$A$1:$A$550\"), MATCH(A92,INDIRECT(\"'\"&$K$1&\"'!$B$1:$B$550\"),0))), \"Not Found\", (INDEX(INDIRECT(\"'\"&$K$1&\"'!$A$1:$A$550\"), MATCH(A92,INDIRECT(\"'\"&$K$1&\"'!$B$1:$B$550\"),0))))","v":"MATH.1310"},null,null,{"$f":"IF(ISNA(VLOOKUP(E92,INDIRECT(\"'\"&$K$1&\"'!$A$1:$H$550\"),8,FALSE)), \"Not Found\", VLOOKUP(E92,INDIRECT(\"'\"&$K$1&\"'!$A$1:$H$550\"),8,FALSE))","v":"Fall2016"},{"$f":"IF(ISNA(VLOOKUP(E92,INDIRECT(\"'\"&$K$1&\"'!$A$1:$H$550\"),5,FALSE)), \"0\", VLOOKUP(E92,INDIRECT(\"'\"&$K$1&\"'!$A$1:$H$550\"),5,FALSE))","v":4}]
["Arts & Humanities"]
["AH-1",null,null,3,{"$f":"IF(ISNA(INDEX(INDIRECT(\"'\"&$K$1&\"'!$A$1:$A$550\"), MATCH(\"*\"&A94&\"*\",INDIRECT(\"'\"&$K$1&\"'!$B$1:$B$550\"),0))), \"Not Found\", (INDEX(INDIRECT(\"'\"&$K$1&\"'!$A$1:$A$550\"), MATCH(\"*\"&A94&\"*\",INDIRECT(\"'\"&$K$1&\"'!$B$1:$B$550\"),0))))","v":"AH-1"},null,null,{"$f":"IF(ISNA(VLOOKUP(E94,INDIRECT(\"'\"&$K$1&\"'!$A$1:$H$550\"),8,FALSE)), \"Not Found\", VLOOKUP(E94,INDIRECT(\"'\"&$K$1&\"'!$A$1:$H$550\"),8,FALSE))","v":"Spring2017"},{"$f":"IF(ISNA(VLOOKUP(E94,INDIRECT(\"'\"&$K$1&\"'!$A$1:$H$550\"),5,FALSE)), \"0\", VLOOKUP(E94,INDIRECT(\"'\"&$K$1&\"'!$A$1:$H$550\"),5,FALSE))","v":3}]
["AH-2",null,null,3,{"$f":"IF(ISNA(INDEX(INDIRECT(\"'\"&$K$1&\"'!$A$1:$A$550\"), MATCH(\"*\"&A95&\"*\",INDIRECT(\"'\"&$K$1&\"'!$B$1:$B$550\"),0))), \"Not Found\", (INDEX(INDIRECT(\"'\"&$K$1&\"'!$A$1:$A$550\"), MATCH(\"*\"&A95&\"*\",INDIRECT(\"'\"&$K$1&\"'!$B$1:$B$550\"),0))))","v":"AH-2"},null,null,"Spring2018",3]
["AH-3",null,null,3,"ENGL.2200",null,null,"Fall2018",3]
["Social Sciences"]
["SS-1",null,null,3,{"$f":"IF(ISNA(INDEX(INDIRECT(\"'\"&$K$1&\"'!$A$1:$A$550\"), MATCH(\"*\"&A98&\"*\",INDIRECT(\"'\"&$K$1&\"'!$B$1:$B$550\"),0))), \"Not Found\", (INDEX(INDIRECT(\"'\"&$K$1&\"'!$A$1:$A$550\"), MATCH(\"*\"&A98&\"*\",INDIRECT(\"'\"&$K$1&\"'!$B$1:$B$550\"),0))))","v":"ECON.2010"},null,null,{"$f":"IF(ISNA(VLOOKUP(E98,INDIRECT(\"'\"&$K$1&\"'!$A$1:$H$550\"),8,FALSE)), \"Not Found\", VLOOKUP(E98,INDIRECT(\"'\"&$K$1&\"'!$A$1:$H$550\"),8,FALSE))","v":"Transfer/AP"},{"$f":"IF(ISNA(VLOOKUP(E98,INDIRECT(\"'\"&$K$1&\"'!$A$1:$H$550\"),5,FALSE)), \"0\", VLOOKUP(E98,INDIRECT(\"'\"&$K$1&\"'!$A$1:$H$550\"),5,FALSE))","v":3}]
["SS-2",null,null,3,"SOCI.2320",null,null,"Fall2016",3]
["SS-3",null,null,3,"SS-3",null,null,"Spring2020",3]
["Sciences with Lab"]
["SC-1",null,null,3,{"$f":"IF(ISNA(INDEX(INDIRECT(\"'\"&$K$1&\"'!$A$1:$A$550\"), MATCH(A102,INDIRECT(\"'\"&$K$1&\"'!$B$1:$B$550\"),0))), \"Not Found\", (INDEX(INDIRECT(\"'\"&$K$1&\"'!$A$1:$A$550\"), MATCH(A102,INDIRECT(\"'\"&$K$1&\"'!$B$1:$B$550\"),0))))","v":"NS-1"},null,null,{"$f":"IF(ISNA(VLOOKUP(E102,INDIRECT(\"'\"&$K$1&\"'!$A$1:$H$550\"),8,FALSE)), \"Not Found\", VLOOKUP(E102,INDIRECT(\"'\"&$K$1&\"'!$A$1:$H$550\"),8,FALSE))","v":"Spring2017"},{"$f":"IF(ISNA(VLOOKUP(E102,INDIRECT(\"'\"&$K$1&\"'!$A$1:$H$550\"),5,FALSE)), \"0\", VLOOKUP(E102,INDIRECT(\"'\"&$K$1&\"'!$A$1:$H$550\"),5,FALSE))","v":3}]
["SCL-1",null,null,1,"NS-Lab1",null,null,"Spring2017",1]
["SC-2",null,null,3,"NS-2",null,null,"Fall2019",3]
["SCL-2",null,null,1,"NS-Lab2",null,null,"Fall2019",1]
["STEM"]
["STEM",null,null,3,{"$f":"IF(ISNA(INDEX(INDIRECT(\"'\"&$K$1&\"'!$A$1:$A$550\"), MATCH(A107,INDIRECT(\"'\"&$K$1&\"'!$B$1:$B$550\"),0))), \"Not Found\", (INDEX(INDIRECT(\"'\"&$K$1&\"'!$A$1:$A$550\"), MATCH(A107,INDIRECT(\"'\"&$K$1&\"'!$B$1:$B$550\"),0))))","v":"NS-3"},null,null,{"$f":"IF(ISNA(VLOOKUP(E107,INDIRECT(\"'\"&$K$1&\"'!$A$1:$H$550\"),8,FALSE)), \"Not Found\", VLOOKUP(E107,INDIRECT(\"'\"&$K$1&\"'!$A$1:$H$550\"),8,FALSE))","v":"Spring2020"},{"$f":"IF(ISNA(VLOOKUP(E107,INDIRECT(\"'\"&$K$1&\"'!$A$1:$H$550\"),5,FALSE)), \"0\", VLOOKUP(E107,INDIRECT(\"'\"&$K$1&\"'!$A$1:$H$550\"),5,FALSE))","v":3}]
[]
["Diversity & Ethics ELOs"]
["Diversity & Cultural Awareness (DV)"]
["DV",null,null,3,{"$f":"IF(ISNA(INDEX(INDIRECT(\"'\"&$K$1&\"'!$A$1:$A$550\"), MATCH(\"*\"&A111&\"*\",INDIRECT(\"'\"&$K$1&\"'!$B$1:$B$550\"),0))), \"Not Found\", (INDEX(INDIRECT(\"'\"&$K$1&\"'!$A$1:$A$550\"), MATCH(\"*\"&A111&\"*\",INDIRECT(\"'\"&$K$1&\"'!$B$1:$B$550\"),0))))","v":"SOCI.2320"},null,null,{"$f":"IF(ISNA(VLOOKUP(E111,INDIRECT(\"'\"&$K$1&\"'!$A$1:$H$550\"),8,FALSE)), \"Not Found\", VLOOKUP(E111,INDIRECT(\"'\"&$K$1&\"'!$A$1:$H$550\"),8,FALSE))","v":"Fall2016"},{"$f":"IF(ISNA(VLOOKUP(E111,INDIRECT(\"'\"&$K$1&\"'!$A$1:$H$550\"),5,FALSE)), \"0\", VLOOKUP(E111,INDIRECT(\"'\"&$K$1&\"'!$A$1:$H$550\"),5,FALSE))","v":3}]
["Social Responsibility & Ethics (ET)"]
["ET",null,null,3,{"$f":"IF(ISNA(INDEX(INDIRECT(\"'\"&$K$1&\"'!$A$1:$A$550\"), MATCH(\"*\"&A113&\"*\",INDIRECT(\"'\"&$K$1&\"'!$B$1:$B$550\"),0))), \"Not Found\", (INDEX(INDIRECT(\"'\"&$K$1&\"'!$A$1:$A$550\"), MATCH(\"*\"&A113&\"*\",INDIRECT(\"'\"&$K$1&\"'!$B$1:$B$550\"),0))))","v":"AH-2"},null,null,{"$f":"IF(ISNA(VLOOKUP(E113,INDIRECT(\"'\"&$K$1&\"'!$A$1:$H$550\"),8,FALSE)), \"Not Found\", VLOOKUP(E113,INDIRECT(\"'\"&$K$1&\"'!$A$1:$H$550\"),8,FALSE))","v":"Spring2018"},{"$f":"IF(ISNA(VLOOKUP(E113,INDIRECT(\"'\"&$K$1&\"'!$A$1:$H$550\"),5,FALSE)), \"0\", VLOOKUP(E113,INDIRECT(\"'\"&$K$1&\"'!$A$1:$H$550\"),5,FALSE))","v":3}]
[]
["Degree Credits",null,null,null,null,null,null,null,"Projected Degree Credits "]
[null,null,null,{"$f":"SUM(D1:D23, D31:D60,D76,D89,D90,D94:D100)","v":120},null,null,null,null,{"$f":"SUM(I1:I23, I31:I60,I76,I89,I90,I94:I100)","v":120}]

{"sheet":"Sample_Plan Bio-cheminformatics","index":5,"n_rows":399,"n_cols":8,"rows_kept":399,"cut":false,"hidden":false,"merged":[[288,2,288,5],[296,2,296,5],[311,2,311,5],[322,0,322,5],[310,0,310,6],[222,0,222,5],[223,2,223,5],[238,2,238,5],[246,2,246,5],[237,0,237,6],[73,2,73,5],[88,3,88,5],[96,2,96,5],[111,2,111,5],[122,0,122,5],[399,1,399,4],[387,1,388,3],[387,4,388,4],[389,1,389,3],[377,1,377,3],[379,1,380,3],[379,4,380,4],[381,1,381,3],[383,1,384,3],[383,4,384,4],[385,1,385,3],[391,1,392,3],[391,4,392,4],[393,1,393,3],[398,1,398,4],[375,1,376,3],[375,4,376,4],[321,0,321,6],[337,0,337,6],[360,0,360,6],[371,0,371,6],[373,1,373,4],[323,2,323,5],[338,2,338,5],[346,2,346,5],[361,2,361,5],[171,0,171,6],[187,0,187,6],[210,0,210,6],[221,0,221,6],[161,2,161,5],[172,0,172,5],[173,2,173,5],[188,2,188,5],[196,2,196,5],[211,2,211,5],[160,0,160,6],[87,0,87,6],[110,0,110,6],[121,0,121,6],[137,0,137,6],[123,2,123,5],[138,2,138,5],[146,2,146,5],[0,0,0,5],[1,0,1,1],[3,0,3,1],[2,0,2,1],[1,2,1,5],[2,2,2,5],[3,2,3,5],[10,0,10,6],[4,0,4,1],[5,0,5,1],[6,0,6,1],[8,0,8,1],[9,0,9,1],[7,0,7,1],[4,2,4,5],[5,2,5,5],[6,2,6,5],[7,2,7,5],[8,2,8,5],[9,2,9,5],[11,0,11,3],[11,4,11,5],[12,0,12,3],[12,4,12,5],[13,0,13,6],[14,0,14,3],[15,0,15,6],[16,0,16,5],[71,0,71,6],[72,0,72,5],[17,0,17,5],[260,0,260,6],[271,0,271,6],[287,0,287,6],[261,2,261,5],[272,0,272,5],[273,2,273,5]]}
["Computer Science Graduation Plan"]
["Student Name",null,"Last Name, First Name"]
["University Id (not ss#)"]
["Email"]
["Primary Major (Option)",null,"Computer Science (Bio-cheminformatics)"]
["Second Major:"]
["Third Major:"]
["Minors(s):"]
["Special Program(s):"]
["Scholarships:"]
[]
["Matriculation Date (Month/Year)",null,null,null,"Sept. 2016"]
["Expected Graduation Date (Month/Year)",null,null,null,"June 2020"]
[]
["Minimum Number of Credits Required for Degree(s)",null,null,null,120]
[]
["Transfer and AP Credits"]
[]
["Course","Req.","Req.","Course Title","Credits","Grade","Degree Credits","SemesterYear"]
[null,null,null,"AP: Physics C - Mechanics",0,2,null,"Transfer/AP"]
["ECON.2020","SS-1",null,"AP: Macroeconomics",3,4,null,"Transfer/AP"]
["ENGL.1010","CW-1",null,"English Literature & Composition",3,"A-",null,"Transfer/AP"]
[null,null,null,null,null,null,null,"Transfer/AP"]
[null,null,null,null,null,null,null,"Transfer/AP"]
[null,null,null,null,null,null,null,"Transfer/AP"]
[null,null,null,null,null,null,null,"Transfer/AP"]
[null,null,null,null,null,null,null,"Transfer/AP"]
[null,null,null,null,null,null,null,"Transfer/AP"]
[null,null,null,null,null,null,null,"Transfer/AP"]
[null,null,null,null,null,null,null,"Transfer/AP"]
[null,null,null,null,null,null,null,"Transfer/AP"]
[null,null,null,null,null,null,null,"Transfer/AP"]
[null,null,null,null,null,null,null,"Transfer/AP"]
[null,null,null,null,null,null,null,"Transfer/AP"]
[null,null,null,null,null,null,null,"Transfer/AP"]
[null,null,null,null,null,null,null,"Transfer/AP"]
[null,null,null,null,null,null,null,"Transfer/AP"]
[null,null,null,null,null,null,null,"Transfer/AP"]
[null,null,null,null,null,null,null,"Transfer/AP"]
[null,null,null,null,null,null,null,"Transfer/AP"]
[null,null,null,null,null,null,null,"Transfer/AP"]
[null,null,null,null,null,null,null,"Transfer/AP"]
[null,null,null,null,null,null,null,"Transfer/AP"]
[null,null,null,null,null,null,null,"Transfer/AP"]
[null,null,null,null,null,null,null,"Transfer/AP"]
[null,null,null,null,null,null,null,"Transfer/AP"]
[null,null,null,null,null,null,null,"Transfer/AP"]
[null,null,null,null,null,null,null,"Transfer/AP"]
[null,null,null,null,null,null,null,"Transfer/AP"]
[null,null,null,null,null,null,null,"Transfer/AP"]
[null,null,null,null,null,null,null,"Transfer/AP"]
[null,null,null,null,null,null,null,"Transfer/AP"]
[null,null,null,null,null,null,null,"Transfer/AP"]
[null,null,null,null,null,null,null,"Transfer/AP"]
[null,null,null,null,null,null,null,"Transfer/AP"]
[null,null,null,null,null,null,null,"Transfer/AP"]
[null,null,null,null,null,null,null,"Transfer/AP"]
[null,null,null,null,null,null,null,"Transfer/AP"]
[null,null,null,null,null,null,null,"Transfer/AP"]
[null,null,null,null,null,null,null,"Transfer/AP"]
[null,null,null,null,null,null,null,"Transfer/AP"]
[null,null,null,null,null,null,null,"Transfer/AP"]
[null,null,null,null,null,null,null,"Transfer/AP"]
[null,null,null,null,null,null,null,"Transfer/AP"]
[null,null,null,null,null,null,null,"Transfer/AP"]
[null,null,null,null,null,null,null,"Transfer/AP"]
[null,null,null,null,null,null,null,"Transfer/AP"]
[null,null,null,null,null,null,null,"Transfer/AP"]
[null,null,null,null,null,null,null,"Transfer/AP"]
[" "," ",null,"Transfer and AP Credits",{"$f":"SUM(E20:E69)","v":6},null,{"$f":"SUM(G20:G69)","v":0}]
[" "," ",null,"Total Credits Earned",{"$f":"E70","v":6},null,{"$f":"E15-G70","v":120}]
[]
["Year 1"]
["Fall","2016",{"$f":"C2","v":"Last Name, First Name"}]
["Course",{"$f":"B19","v":"Req."},{"$f":"C19","v":"Req."},"Course Title","Credits","Grade","Degree Credits","SemesterYear"]
["COMP.1010",null,null,"Computing I",3,null,null,{"$f":"$A$74&$B$74","v":"Fall2016"}]
["COMP.1030L",null,null,"Computing I Lab",1,null,null,{"$f":"$A$74&$B$74","v":"Fall2016"}]
["MATH.1310","MA",null,"Calculus I",4,null,null,"Fall2016"]
["ENGL.1020","CW-2",null,"College Writing II",3,null,null,"Fall2016"]
["BIOL.1110",null,null,"Principles of Biology I",3,null,null,"Fall2016"]
["BIOL.1170L",null,null,"Experimental Biology I",1,null,null,"Fall2016"]
[null,null,null,null,null,null,null,"Fall2016"]
[null,null,null,null,null,null,null,"Fall2016"]
[null,null,null,null,null,null,null,"Fall2016"]
[null,null,null,null,null,null,null,"Fall2016"]
[" "," ",null,"Semester Credits Earned",{"$f":"SUM(E76:E85)","v":15},null,{"$f":"SUM(G76:G85)","v":0}]
[" "," ",null,{"$f":"D71","v":"Total Credits Earned"},{"$f":"E71+E86","v":21},null,{"$f":"G71-G86","v":120}]
[]
["Winter",{"$f":"B74+1","v":2017},{"$f":"C2","v":"Last Name, First Name"}]
["Course",{"$f":"B19","v":"Req."},null,"Course Title","Credits","Grade","Degree Credits","SemesterYear"]
[null,null,null,null,null,null,null,{"$f":"$A$89&$B$89","v":"Winter2017"}]
[null,null,null,null,null,null,null,{"$f":"$A$89&$B$89","v":"Winter2017"}]
[null,null,null,null,null,null,null,"Winter2017"]
[" "," ",null,{"$f":"D86","v":"Semester Credits Earned"},{"$f":"SUM(E91:E93)","v":0},null,{"$f":"SUM(G91:G93)","v":0}]
[" "," ",null,{"$f":"D71","v":"Total Credits Earned"},{"$f":"E87+E94","v":21},null,{"$f":"G87-G94","v":120}]
[]
["Spring",{"$f":"B74+1","v":2017},{"$f":"C2","v":"Last Name, First Name"}]
["Course",{"$f":"B19","v":"Req."},{"$f":"C19","v":"Req."},"Course Title","Credits","Grade","Degree Credits","SemesterYear"]
["COMP.1020",null,null,"Computing II",3,null,null,{"$f":"$A$97&$B$97","v":"Spring2017"}]
["COMP.1040L",null,null,"Computer II Lab",1,null,null,{"$f":"$A$97&$B$97","v":"Spring2017"}]
["MATH.1320",null,null,"Calculus II",4,null,null,"Spring2017"]
["SOCI.2320","SS-2,DV",null,"Social Psychology",3,null,null,"Spring2017"]
["Gen-Ed","SS-3",null,"Breadth of Knowledge Requirement",3,null,null,"Spring2017"]
[null,null,null,null,null,null,null,"Spring2017"]
[null,null,null,null,null,null,null,"Spring2017"]
[null,null,null,null,null,null,null,"Spring2017"]
[null,null,null,null,null,null,null,"Spring2017"]
[null,null,null,null,null,null,null,"Spring2017"]
[" "," ",null,{"$f":"D86","v":"Semester Credits Earned"},{"$f":"SUM(E99:E108)","v":14},null,{"$f":"SUM(G99:G108)","v":0}]
[" "," ",null,{"$f":"D71","v":"Total Credits Earned"},{"$f":"E95+E109","v":35},null,{"$f":"G95-G109","v":120}]
[]
["Summer",{"$f":"B74+1","v":2017},{"$f":"C2","v":"Last Name, First Name"}]
["Course",{"$f":"B19","v":"Req."},{"$f":"C19","v":"Req."},"Course Title","Credits","Grade","Degree Credits","SemesterYear"]
[null,null,null,null,null,null,null,{"$f":"$A$112&$B$112","v":"Summer2017"}]
[null,null,null,null,null,null,null,{"$f":"$A$112&$B$112","v":"Summer2017"}]
[null,null,null,null,null,null,null,"Summer2017"]
[null,null,null,null,null,null,null,"Summer2017"]
[null,null,null,null,null,null,null,"Summer2017"]
[null,null,null,null,null,null,null,"Summer2017"]
[" "," ",null,{"$f":"D86","v":"Semester Credits Earned"},{"$f":"SUM(E114:E119)","v":0},null,{"$f":"SUM(G114:G119)","v":0}]
[" "," ",null,{"$f":"D71","v":"Total Credits Earned"},{"$f":"E110+E120","v":35},null,{"$f":"G110-G120","v":120}]
[]
["Year 2"]
["Fall",{"$f":"B74+1","v":2017},{"$f":"C2","v":"Last Name, First Name"}]
["Course",{"$f":"B19","v":"Req."},{"$f":"C19","v":"Req."},"Course Title","Credits","Grade","Degree Credits","SemesterYear"]
["COMP.2010",null,null,"Computing III",3,null,null,{"$f":"$A$124&$B$124","v":"Fall2017"}]
["COMP.2010L",null,null,"Computing III Lab",1,null,null,{"$f":"$A$124&$B$124","v":"Fall2017"}]
["COMP.2030",null,null,"Assembly Language Programming",3,null,null,"Fall2017"]
["COMP.2030L",null,null,"Assembly Language Programming Lab",1,null,null,"Fall2017"]
["MATH.3210",null,null,"Discrete Structures I",3,null,null,"Fall2017"]
["CHEM.1210","SC-1",null,"Chemistry I",3,null,null,"Fall2017"]
["CHEM.1230L","SCL-1",null,"Chemistry Lab I",1,null,null,"Fall2017"]
[null,null,null,null,null,null,null,"Fall2017"]
[null,null,null,null,null,null,null,"Fall2017"]
[null,null,null,null,null,null,null,"Fall2017"]
[" "," ",null,{"$f":"D86","v":"Semester Credits Earned"},{"$f":"SUM(E126:E135)","v":15},null,{"$f":"SUM(G126:G135)","v":0}]
[" "," ",null,{"$f":"D71","v":"Total Credits Earned"},{"$f":"E121+E136","v":50},null,{"$f":"G121-G136","v":120}]
[]
["Winter",{"$f":"B74+2","v":2018},{"$f":"C2","v":"Last Name, First Name"}]
["Course",{"$f":"B19","v":"Req."},{"$f":"C19","v":"Req."},"Course Title","Credits","Grade","Degree Credits","SemesterYear"]
[null,null,null,null,null,null,null,{"$f":"$A$139&$B$139","v":"Winter2018"}]
[null,null,null,null,null,null,null,{"$f":"$A$139&$B$139","v":"Winter2018"}]
[null,null,null,null,null,null,null,"Winter2018"]
[" "," ",null,{"$f":"D86","v":"Semester Credits Earned"},{"$f":"SUM(E141:E143)","v":0},null,{"$f":"SUM(G141:G143)","v":0}]
[" "," ",null,{"$f":"D71","v":"Total Credits Earned"},{"$f":"E137+E144","v":50},null,{"$f":"G137-G144","v":120}]
[]
["Spring",{"$f":"B89+1","v":2018},{"$f":"C2","v":"Last Name, First Name"}]
["Course",{"$f":"B19","v":"Req."},{"$f":"C19","v":"Req."},"Course Title","Credits","Grade","Degree Credits","SemesterYear"]
["COMP.2040",null,null,"Computing IV",3,null,null,{"$f":"$A$147&$B$147","v":"Spring2018"}]
["EECE.2650",null,null,"Logic Design",3,null,null,{"$f":"$A$147&$B$147","v":"Spring2018"}]
["MATH.3220",null,null,"Discrete Structures II",3,null,null,"Spring2018"]
["CHEM.1220","SC-2",null,"Chemistry II",3,null,null,"Spring2018"]
["CHEM.1240L","SCL-2",null,"Chemistry Lab II",1,null,null,"Spring2018"]
[null,null,null,null,null,null,null,"Spring2018"]
[null,null,null,null,null,null,null,"Spring2018"]
[null,null,null,null,null,null,null,"Spring2018"]
[null,null,null,null,null,null,null,"Spring2018"]
[null,null,null,null,null,null,null,"Spring2018"]
[" "," ",null,{"$f":"D86","v":"Semester Credits Earned"},{"$f":"SUM(E149:E158)","v":13},null,{"$f":"SUM(G149:G158)","v":0}]
[" "," ",null,{"$f":"D71","v":"Total Credits Earned"},{"$f":"E145+E159","v":63},null,{"$f":"G145-G159","v":120}]
[]
["Summer",{"$f":"B74+2","v":2018},{"$f":"C2","v":"Last Name, First Name"}]
["Course",{"$f":"B19","v":"Req."},{"$f":"C19","v":"Req."},"Course Title","Credits","Grade","Degree Credits","SemesterYear"]
[null,null,null,null,null,null,null,{"$f":"$A$162&$B$162","v":"Summer2018"}]
[null,null,null,null,null,null,null,{"$f":"$A$162&$B$162","v":"Summer2018"}]
[null,null,null,null,null,null,null,"Summer2018"]
[null,null,null,null,null,null,null,"Summer2018"]
[null,null,null,null,null,null,null,"Summer2018"]
[null,null,null,null,null,null,null,"Summer2018"]
[" "," ",null,{"$f":"D86","v":"Semester Credits Earned"},{"$f":"SUM(E164:E169)","v":0},null,{"$f":"SUM(G163:G169)","v":0}]
[" "," ",null,{"$f":"D71","v":"Total Credits Earned"},{"$f":"E160+E170","v":63},null,{"$f":"G160-G170","v":120}]
[]
["Year 3"]
["Fall",{"$f":"B74+2","v":2018},{"$f":"C2","v":"Last Name, First Name"}]
["Course",{"$f":"B19","v":"Req."},{"$f":"C19","v":"Req."},"Course Title","Credits","Grade","Degree Credits","SemesterYear"]
["COMP.3040",null,null,"Foundations of Computer Science",3,null,null,{"$f":"$A$174&$B$174","v":"Fall2018"}]
["COMP.3050",null,null,"Computer Architecture",3,null,null,{"$f":"$A$174&$B$174","v":"Fall2018"}]
["MATH.3860",null,null,"Probability and Statistics I",3,null,null,"Fall2018"]
["BIOL.2350","STEM",null,"Genetics",3,null,null,"Fall2018"]
["BIOL.2370",null,null,"Problems in Genetics",1,null,null,"Fall2018"]
["CSET","AH-1,ET","CSET","Breadth of Knowledge Requirement",3,null,null,"Fall2018"]
[null,null,null,null,null,null,null,"Fall2018"]
[null,null,null,null,null,null,null,"Fall2018"]
[null,null,null,null,null,null,null,"Fall2018"]
[null,null,null,null,null,null,null,"Fall2018"]
[" "," ",null,{"$f":"D86","v":"Semester Credits Earned"},{"$f":"SUM(E176:E185)","v":16},null,{"$f":"SUM(G176:G185)","v":0}]
[" "," ",null,{"$f":"D71","v":"Total Credits Earned"},{"$f":"E171+E186","v":79},null,{"$f":"G171-G186","v":120}]
[]
["Winter",{"$f":"B74+3","v":2019},{"$f":"C2","v":"Last Name, First Name"}]
["Course",{"$f":"B19","v":"Req."},{"$f":"C19","v":"Req."},"Course Title","Credits","Grade","Degree Credits","SemesterYear"]
[null,null,null,null,null,null,null,{"$f":"$A$189&$B$189","v":"Winter2019"}]
[null,null,null,null,null,null,null,{"$f":"$A$189&$B$189","v":"Winter2019"}]
[null,null,null,null,null,null,null,"Winter2019"]
[" "," ",null,{"$f":"D86","v":"Semester Credits Earned"},{"$f":"SUM(E191:E193)","v":0},null,{"$f":"SUM(G191:G193)","v":0},{"$f":"SUM(H191:H193)","v":0}]
[" "," ",null,{"$f":"D71","v":"Total Credits Earned"},{"$f":"E187+E194","v":79},null,{"$f":"G187-G194","v":120}]
[]
["Spring",{"$f":"B74+3","v":2019},{"$f":"C2","v":"Last Name, First Name"}]
["Course",{"$f":"B19","v":"Req."},{"$f":"C19","v":"Req."},"Course Title","Credits","Grade","Degree Credits","SemesterYear"]
["COMP.3010",null,null,"Organization of Programming Languages",3,null,null,{"$f":"$A$197&$B$197","v":"Spring2019"}]
["COMP.3080",null,null,"Introduction to Operating Systems",3,null,null,{"$f":"$A$197&$B$197","v":"Spring2019"}]
["BCIE-1","BCIE-1",null,"Bio/Chemiformatics Elective",3,null,null,"Spring2019"]
["ENGL.2200","AH-2",null,"Oral & Written Communication for CS",3,null,null,"Spring2019"]
["FE-1","FE-1",null,"Free Elective",3,null,null,"Spring2019"]
[null,null,null,null,null,null,null,"Spring2019"]
[null,null,null,null,null,null,null,"Spring2019"]
[null,null,null,null,null,null,null,"Spring2019"]
[null,null,null,null,null,null,null,"Spring2019"]
[null,null,null,null,null,null,null,"Spring2019"]
[" "," ",null,{"$f":"D86","v":"Semester Credits Earned"},{"$f":"SUM(E199:E208)","v":15},null,{"$f":"SUM(G199:G208)","v":0}]
[" "," ",null,{"$f":"D71","v":"Total Credits Earned"},{"$f":"E195+E209","v":94},null,{"$f":"G195-G209","v":120}]
[]
["Summer",{"$f":"B74+3","v":2019},{"$f":"C2","v":"Last Name, First Name"}]
["Course",{"$f":"B19","v":"Req."},{"$f":"C19","v":"Req."},"Course Title","Credits","Grade","Degree Credits","SemesterYear"]
[null,null,null,null,null,null,null,{"$f":"$A$212&$B$212","v":"Summer2019"}]
[null,null,null,null,null,null,null,{"$f":"$A$212&$B$212","v":"Summer2019"}]
[null,null,null,null,null,null,null,"Summer2019"]
[null,null,null,null,null,null,null,"Summer2019"]
[null,null,null,null,null,null,null,"Summer2019"]
[null,null,null,null,null,null,null,"Summer2019"]
[" "," ",null,{"$f":"D86","v":"Semester Credits Earned"},{"$f":"SUM(E214:E219)","v":0},null,{"$f":"SUM(G213:G219)","v":0}]
[" "," ",null,{"$f":"D71","v":"Total Credits Earned"},{"$f":"E210+E220","v":94},null,{"$f":"G210-G220","v":120}]
[]
["Year 4"]
["Fall",{"$f":"B74+3","v":2019},{"$f":"C2","v":"Last Name, First Name"}]
["Course",{"$f":"B19","v":"Req."},{"$f":"C19","v":"Req."},"Course Title","Credits","Grade","Degree Credits","SemesterYear"]
["COMP.4040",null,null,"Analysis of Algorithms",3,null,null,{"$f":"$A$224&$B$224","v":"Fall2019"}]
["COMP.4xxx-p1","Sr.Prj-1",null,"Project Course - part 1",3,null,null,{"$f":"$A$224&$B$224","v":"Fall2019"}]
["BCIE-2","BCIE-2",null,"Bio/Chemiformatics Elective",3,null,null,"Fall2019"]
["FE-2","FE-2",null,"Free Elective",3,null,null,"Fall2019"]
["FE-3","FE-3",null,"Free Elective",3,null,null,"Fall2019"]
[null,null,null,null,null,null,null,"Fall2019"]
[null,null,null,null,null,null,null,"Fall2019"]
[null,null,null,null,null,null,null,"Fall2019"]
[null,null,null,null,null,null,null,"Fall2019"]
[null,null,null,null,null,null,null,"Fall2019"]
[" "," ",null,{"$f":"D86","v":"Semester Credits Earned"},{"$f":"SUM(E226:E235)","v":15},null,{"$f":"SUM(G226:G235)","v":0}]
[" "," ",null,{"$f":"D71","v":"Total Credits Earned"},{"$f":"E221+E236","v":109},null,{"$f":"G221-G236","v":120}]
[]
["Winter",{"$f":"B74+4","v":2020},{"$f":"C2","v":"Last Name, First Name"}]
["Course",{"$f":"B19","v":"Req."},{"$f":"C19","v":"Req."},"Course Title","Credits","Grade","Degree Credits","SemesterYear"]
[null,null,null,null,null,null,null,{"$f":"$A$239&$B$239","v":"Winter2020"}]
[null,null,null,null,null,null,null,{"$f":"$A$239&$B$239","v":"Winter2020"}]
[null,null,null,null,null,null,null,"Winter2020"]
[" "," ",null,{"$f":"D86","v":"Semester Credits Earned"},{"$f":"SUM(E241:E243)","v":0},null,{"$f":"SUM(G241:G243)","v":0}]
[" "," ",null,{"$f":"D71","v":"Total Credits Earned"},{"$f":"E237+E244","v":109},null,{"$f":"G237-G244","v":120}]
[]
["Spring",{"$f":"B74+4","v":2020},{"$f":"C2","v":"Last Name, First Name"}]
["Course",{"$f":"B19","v":"Req."},{"$f":"C19","v":"Req."},"Course Title","Credits","Grade","Degree Credits","SemesterYear"]
["COMP.4xxx-p2","Sr.Prj-2",null,"Project Course - part 2",3,null,null,{"$f":"$A$247&$B$247","v":"Spring2020"}]
["BCIE-3","BCIE-3",null,"Bio/Chemiformatics Elective",3,null,null,{"$f":"$A$247&$B$247","v":"Spring2020"}]
["AH-3","AH-3",null,"Breadth of Knowledge Requirement",3,null,null,"Spring2020"]
["FE-4","FE-4",null,"Free Elective",3,null,null,"Spring2020"]
[null,null,null,null,null,null,null,"Spring2020"]
[null,null,null,null,null,null,null,"Spring2020"]
[null,null,null,null,null,null,null,"Spring2020"]
[null,null,null,null,null,null,null,"Spring2020"]
[null,null,null,null,null,null,null,"Spring2020"]
[null,null,null,null,null,null,null,"Spring2020"]
[" "," ",null,{"$f":"D86","v":"Semester Credits Earned"},{"$f":"SUM(E249:E258)","v":12},null,{"$f":"SUM(G249:G258)","v":0}]
[" "," ",null,{"$f":"D71","v":"Total Credits Earned"},{"$f":"E245+E259","v":121},null,{"$f":"G245-G259","v":120}]
[]
["Summer",{"$f":"B74+4","v":2020},{"$f":"C2","v":"Last Name, First Name"}]
["Course",{"$f":"B19","v":"Req."},{"$f":"C19","v":"Req."},"Course Title","Credits","Grade","Degree Credits","SemesterYear"]
[null,null,null,null,null,null,null,{"$f":"$A$262&$B$262","v":"Summer2020"}]
[null,null,null,null,null,null,null,{"$f":"$A$262&$B$262","v":"Summer2020"}]
[null,null,null,null,null,null,null,"Summer2020"]
[null,null,null,null,null,null,null,"Summer2020"]
[null,null,null,null,null,null,null,"Summer2020"]
[null,null,null,null,null,null,null,"Summer2020"]
[" "," ",null,{"$f":"D86","v":"Semester Credits Earned"},{"$f":"SUM(E264:E269)","v":0},null,{"$f":"SUM(G263:G269)","v":0}]
[" "," ",null,{"$f":"D71","v":"Total Credits Earned"},{"$f":"E260+E270","v":121},null,{"$f":"G260-G270","v":120}]
[]
["Year 5"]
["Fall",{"$f":"B74+4","v":2020},{"$f":"C2","v":"Last Name, First Name"}]
["Course",{"$f":"B19","v":"Req."},{"$f":"C19","v":"Req."},"Course Title","Credits","Grade","Degree Credits","SemesterYear"]
[null,null,null,null,null,null,null,{"$f":"$A$274&$B$274","v":"Fall2020"}]
[null,null,null,null,null,null,null,{"$f":"$A$274&$B$274","v":"Fall2020"}]
[null,null,null,null,null,null,null,"Fall2020"]
[null,null,null,null,null,null,null,"Fall2020"]
[null,null,null,null,null,null,null,"Fall2020"]
[null,null,null,null,null,null,null,"Fall2020"]
[null,null,null,null,null,null,null,"Fall2020"]
[null,null,null,null,null,null,null,"Fall2020"]
[null,null,null,null,null,null,null,"Fall2020"]
[null,null,null,null,null,null,null,"Fall2020"]
[" "," ",null,{"$f":"D86","v":"Semester Credits Earned"},{"$f":"SUM(E276:E285)","v":0},null,{"$f":"SUM(G276:G285)","v":0}]
[" "," ",null,{"$f":"D71","v":"Total Credits Earned"},{"$f":"E271+E286","v":121},null,{"$f":"G271-G286","v":120}]
[]
["Winter",{"$f":"B74+5","v":2021},{"$f":"C2","v":"Last Name, First Name"}]
["Course",{"$f":"B19","v":"Req."},{"$f":"C19","v":"Req."},"Course Title","Credits","Grade","Degree Credits","SemesterYear"]
[null,null,null,null,null,null,null,{"$f":"$A$289&$B$289","v":"Winter2021"}]
[null,null,null,null,null,null,null,{"$f":"$A$289&$B$289","v":"Winter2021"}]
[null,null,null,null,null,null,null,"Winter2021"]
[" "," ",null,{"$f":"D86","v":"Semester Credits Earned"},{"$f":"SUM(E291:E293)","v":0},null,{"$f":"SUM(G291:G293)","v":0}]
[" "," ",null,{"$f":"D71","v":"Total Credits Earned"},{"$f":"E287+E294","v":121},null,{"$f":"G287-G294","v":120}]
[]
["Spring",{"$f":"B74+5","v":2021},{"$f":"C2","v":"Last Name, First Name"}]
["Course",{"$f":"B19","v":"Req."},{"$f":"C19","v":"Req."},"Course Title","Credits","Grade","Degree Credits","SemesterYear"]
[null,null,null,null,null,null,null,{"$f":"$A$297&$B$297","v":"Spring2021"}]
[null,null,null,null,null,null,null,{"$f":"$A$297&$B$297","v":"Spring2021"}]
[null,null,null,null,null,null,null,"Spring2021"]
[null,null,null,null,null,null,null,"Spring2021"]
[null,null,null,null,null,null,null,"Spring2021"]
[null,null,null,null,null,null,null,"Spring2021"]
[null,null,null,null,null,null,null,"Spring2021"]
[null,null,null,null,null,null,null,"Spring2021"]
[null,null,null,null,null,null,null,"Spring2021"]
[null,null,null,null,null,null,null,"Spring2021"]
[" "," ",null,{"$f":"D86","v":"Semester Credits Earned"},{"$f":"SUM(E299:E308)","v":0},null,{"$f":"SUM(G299:G308)","v":0}]
[" "," ",null,{"$f":"D71","v":"Total Credits Earned"},{"$f":"E295+E309","v":121},null,{"$f":"G295-G309","v":120}]
[]
["Summer",{"$f":"B74+5","v":2021},{"$f":"C2","v":"Last Name, First Name"}]
["Course",{"$f":"B19","v":"Req."},{"$f":"C19","v":"Req."},"Course Title","Credits","Grade","Degree Credits","SemesterYear"]
[null,null,null,null,null,null,null,{"$f":"$A$312&$B$312","v":"Summer2021"}]
[null,null,null,null,null,null,null,{"$f":"$A$312&$B$312","v":"Summer2021"}]
[null,null,null,null,null,null,null,"Summer2021"]
[null,null,null,null,null,null,null,"Summer2021"]
[null,null,null,null,null,null,null,"Summer2021"]
[null,null,null,null,null,null,null,"Summer2021"]
[" "," ",null,{"$f":"D86","v":"Semester Credits Earned"},{"$f":"SUM(E314:E319)","v":0},null,{"$f":"SUM(G313:G319)","v":0}]
[" "," ",null,{"$f":"D71","v":"Total Credits Earned"},{"$f":"E310+E320","v":121},null,{"$f":"G310-G320","v":120}]
[]
["Year 6"]
["Fall",{"$f":"B74+5","v":2021},{"$f":"C2","v":"Last Name, First Name"}]
["Course",{"$f":"B19","v":"Req."},{"$f":"C19","v":"Req."},"Course Title","Credits","Grade","Degree Credits","SemesterYear"]
[null,null,null,null,null,null,null,{"$f":"$A$324&$B$324","v":"Fall2021"}]
[null,null,null,null,null,null,null,{"$f":"$A$324&$B$324","v":"Fall2021"}]
[null,null,null,null,null,null,null,"Fall2021"]
[null,null,null,null,null,null,null,"Fall2021"]
[null,null,null,null,null,null,null,"Fall2021"]
[null,null,null,null,null,null,null,"Fall2021"]
[null,null,null,null,null,null,null,"Fall2021"]
[null,null,null,null,null,null,null,"Fall2021"]
[null,null,null,null,null,null,null,"Fall2021"]
[null,null,null,null,null,null,null,"Fall2021"]
[" "," ",null,{"$f":"D136","v":"Semester Credits Earned"},{"$f":"SUM(E326:E335)","v":0},null,{"$f":"SUM(G326:G335)","v":0}]
[" "," ",null,{"$f":"D121","v":"Total Credits Earned"},{"$f":"E321+E336","v":121},null,{"$f":"G321-G336","v":120}]
[]
["Winter",{"$f":"B74+6","v":2022},{"$f":"C2","v":"Last Name, First Name"}]
["Course",{"$f":"B19","v":"Req."},{"$f":"C19","v":"Req."},"Course Title","Credits","Grade","Degree Credits","SemesterYear"]
[null,null,null,null,null,null,null,{"$f":"$A$339&$B$339","v":"Winter2022"}]
[null,null,null,null,null,null,null,{"$f":"$A$339&$B$339","v":"Winter2022"}]
[null,null,null,null,null,null,null,"Winter2022"]
[" "," ",null,{"$f":"D136","v":"Semester Credits Earned"},{"$f":"SUM(E341:E343)","v":0},null,{"$f":"SUM(G341:G343)","v":0}]
[" "," ",null,{"$f":"D121","v":"Total Credits Earned"},{"$f":"E337+E344","v":121},null,{"$f":"G337-G344","v":120}]
[]
["Spring",{"$f":"B74+6","v":2022},{"$f":"C2","v":"Last Name, First Name"}]
["Course",{"$f":"B19","v":"Req."},{"$f":"C19","v":"Req."},"Course Title","Credits","Grade","Degree Credits","SemesterYear"]
[null,null,null,null,null,null,null,{"$f":"$A$347&$B$347","v":"Spring2022"}]
[null,null,null,null,null,null,null,{"$f":"$A$347&$B$347","v":"Spring2022"}]
[null,null,null,null,null,null,null,"Spring2022"]
[null,null,null,null,null,null,null,"Spring2022"]
[null,null,null,null,null,null,null,"Spring2022"]
[null,null,null,null,null,null,null,"Spring2022"]
[null,null,null,null,null,null,null,"Spring2022"]
[null,null,null,null,null,null,null,"Spring2022"]
[null,null,null,null,null,null,null,"Spring2022"]
[null,null,null,null,null,null,null,"Spring2022"]
[" "," ",null,{"$f":"D136","v":"Semester Credits Earned"},{"$f":"SUM(E349:E358)","v":0},null,{"$f":"SUM(G349:G358)","v":0}]
[" "," ",null,{"$f":"D121","v":"Total Credits Earned"},{"$f":"E345+E359","v":121},null,{"$f":"G345-G359","v":120}]
[]
["Summer",{"$f":"B74+6","v":2022},{"$f":"C2","v":"Last Name, First Name"}]
["Course",{"$f":"B19","v":"Req."},{"$f":"C19","v":"Req."},"Course Title","Credits","Grade","Degree Credits","SemesterYear"]
[null,null,null,null,null,null,null,{"$f":"$A$362&$B$362","v":"Summer2022"}]
[null,null,null,null,null,null,null,{"$f":"$A$362&$B$362","v":"Summer2022"}]
[null,null,null,null,null,null,null,"Summer2022"]
[null,null,null,null,null,null,null,"Summer2022"]
[null,null,null,null,null,null,null,"Summer2022"]
[null,null,null,null,null,null,null,"Summer2022"]
[" "," ",null,{"$f":"D136","v":"Semester Credits Earned"},{"$f":"SUM(E364:E369)","v":0},null,{"$f":"SUM(G363:G369)","v":0}]
[" "," ",null,{"$f":"D121","v":"Total Credits Earned"},{"$f":"E360+E370","v":121},null,{"$f":"G360-G370","v":120}]
[]
[]
[null,"Graduation Plan Review & Approval"]
[]
[null," "]
[]
[null,"Initial Review: OASiS",null,null,"Date"]
[]
[]
[]
[null,"Additional Review: Faculty Mentor",null,null,"Date"]
[]
[null," ",null,null," "]
[]
[null,"Secondary Major Review",null,null,"Date"]
[]
[null," ",null,null," "]
[]
[null,"Final Review: OASiS Approval",null,null,"Date"]
[]
[null," ",null,null," "]
[]
[null,{"$f":"C2","v":"Last Name, First Name"},null,null,"Date"]
[]
[]
[]
[]
[null,"OASiS Comments"]

{"sheet":"Sample_Checklist Bio-cheminform","index":6,"n_rows":97,"n_cols":13,"rows_kept":97,"cut":false,"hidden":false,"merged":[[47,11,47,12],[48,11,48,12],[92,0,92,8],[77,0,77,8],[81,0,81,8],[89,0,89,8],[66,0,66,8],[68,0,68,8],[71,0,71,8],[73,0,73,8],[66,11,66,12],[67,11,67,12],[86,0,86,8],[90,0,90,8],[58,0,58,8],[62,0,62,8],[0,0,0,8],[2,0,2,8],[17,0,17,8],[46,11,46,12],[0,11,0,12],[1,11,1,12],[21,0,21,8],[35,0,35,8],[40,0,40,8],[25,0,25,8],[27,0,27,8],[29,0,29,8],[46,0,46,8],[1,4,1,6],[26,0,26,2],[26,4,26,6],[47,0,47,2],[47,4,47,6],[59,0,59,2],[59,4,59,6],[67,0,67,2],[67,4,67,6],[63,4,63,6],[63,0,63,2]]}
["Checklist -Bio/Cheminformatics",null,null,null,null,null,null,null,null,null,"Sample_Plan Bio-Cheminformatics","Required Bio/Cheminformatics Electives"]
["Requirement",null,null,"Credits","Taken",null,null,"Semester","Credits",null,null,"List courses you are interested in possibly taking. (NOTE: This is not required.)"]
["Required Computer Science Courses",null,null,null,null,null,null,null,null,null,null,"Course","Title"]
["COMP.1010","or","91.101",3,"COMP.1010","or","91.101",{"$f":"IF(AND(ISNA(VLOOKUP(E4,INDIRECT(\"'\"&$K$1&\"'!$A$1:$H$550\"),8,FALSE)), ISNA(VLOOKUP(G4,INDIRECT(\"'\"&$K$1&\"'!$A$1:$H$550\"),8,FALSE))), \"Not Found\", (IF(ISNA(VLOOKUP(E4,INDIRECT(\"'\"&$K$1&\"'!$A$1:$H$550\"),8,FALSE)), VLOOKUP(G4,INDIRECT(\"'\"&$K$1&\"'!$A$1:$H$550\"),8,FALSE), VLOOKUP(E4,INDIRECT(\"'\"&$K$1&\"'!$A$1:$H$550\"),8,FALSE))))","v":"Fall2016"},{"$f":"IF(AND(ISNA(VLOOKUP(E4,INDIRECT(\"'\"&$K$1&\"'!$A$1:$H$550\"),5,FALSE)), ISNA(VLOOKUP(G4,INDIRECT(\"'\"&$K$1&\"'!$A$1:$H$550\"),5,FALSE))), \"0\", (IF(ISNA(VLOOKUP(E4,INDIRECT(\"'\"&$K$1&\"'!$A$1:$H$550\"),5,FALSE)), VLOOKUP(G4,INDIRECT(\"'\"&$K$1&\"'!$A$1:$H$550\"),5,FALSE), VLOOKUP(E4,INDIRECT(\"'\"&$K$1&\"'!$A$1:$H$550\"),5,FALSE))))","v":3}]
["COMP.1030L","or","91.103",1,"COMP.1030L","or","91.103",{"$f":"IF(AND(ISNA(VLOOKUP(E5,INDIRECT(\"'\"&$K$1&\"'!$A$1:$H$550\"),8,FALSE)), ISNA(VLOOKUP(G5,INDIRECT(\"'\"&$K$1&\"'!$A$1:$H$550\"),8,FALSE))), \"Not Found\", (IF(ISNA(VLOOKUP(E5,INDIRECT(\"'\"&$K$1&\"'!$A$1:$H$550\"),8,FALSE)), VLOOKUP(G5,INDIRECT(\"'\"&$K$1&\"'!$A$1:$H$550\"),8,FALSE), VLOOKUP(E5,INDIRECT(\"'\"&$K$1&\"'!$A$1:$H$550\"),8,FALSE))))","v":"Fall2016"},{"$f":"IF(AND(ISNA(VLOOKUP(E5,INDIRECT(\"'\"&$K$1&\"'!$A$1:$H$550\"),5,FALSE)), ISNA(VLOOKUP(G5,INDIRECT(\"'\"&$K$1&\"'!$A$1:$H$550\"),5,FALSE))), \"0\", (IF(ISNA(VLOOKUP(E5,INDIRECT(\"'\"&$K$1&\"'!$A$1:$H$550\"),5,FALSE)), VLOOKUP(G5,INDIRECT(\"'\"&$K$1&\"'!$A$1:$H$550\"),5,FALSE), VLOOKUP(E5,INDIRECT(\"'\"&$K$1&\"'!$A$1:$H$550\"),5,FALSE))))","v":1}]
["COMP.1020","or","91.102",3,"COMP.1020","or","91.102","Spring2017",3]
["COMP.1040L","or","91.104",1,"COMP.1040L","or","91.104","Spring2017",1]
["COMP.2010","or","91.201",3,"COMP.2010","or","91.201","Fall2017",3]
["COMP.2010L",null,null,1,"COMP.2010L",null,null,{"$f":"IF(AND(ISNA(VLOOKUP(E9,INDIRECT(\"'\"&$K$1&\"'!$A$1:$H$550\"),8,FALSE)), ISNA(VLOOKUP(G9,INDIRECT(\"'\"&$K$1&\"'!$A$1:$H$550\"),8,FALSE))), \"Not Found\", (IF(ISNA(VLOOKUP(E9,INDIRECT(\"'\"&$K$1&\"'!$A$1:$H$550\"),8,FALSE)), VLOOKUP(G9,INDIRECT(\"'\"&$K$1&\"'!$A$1:$H$550\"),8,FALSE), VLOOKUP(E9,INDIRECT(\"'\"&$K$1&\"'!$A$1:$H$550\"),8,FALSE))))","v":"Fall2017"},{"$f":"IF(AND(ISNA(VLOOKUP(E9,INDIRECT(\"'\"&$K$1&\"'!$A$1:$H$550\"),5,FALSE)), ISNA(VLOOKUP(G9,INDIRECT(\"'\"&$K$1&\"'!$A$1:$H$550\"),5,FALSE))), \"0\", (IF(ISNA(VLOOKUP(E9,INDIRECT(\"'\"&$K$1&\"'!$A$1:$H$550\"),5,FALSE)), VLOOKUP(G9,INDIRECT(\"'\"&$K$1&\"'!$A$1:$H$550\"),5,FALSE), VLOOKUP(E9,INDIRECT(\"'\"&$K$1&\"'!$A$1:$H$550\"),5,FALSE))))","v":1}]
["COMP.2030","or","91.203",3,"COMP.2030","or","91.203","Fall2017",3]
["COMP.2030L",null,null,1,"COMP.2030L",null,null,{"$f":"IF(AND(ISNA(VLOOKUP(E11,INDIRECT(\"'\"&$K$1&\"'!$A$1:$H$550\"),8,FALSE)), ISNA(VLOOKUP(G11,INDIRECT(\"'\"&$K$1&\"'!$A$1:$H$550\"),8,FALSE))), \"Not Found\", (IF(ISNA(VLOOKUP(E11,INDIRECT(\"'\"&$K$1&\"'!$A$1:$H$550\"),8,FALSE)), VLOOKUP(G11,INDIRECT(\"'\"&$K$1&\"'!$A$1:$H$550\"),8,FALSE), VLOOKUP(E11,INDIRECT(\"'\"&$K$1&\"'!$A$1:$H$550\"),8,FALSE))))","v":"Fall2017"},{"$f":"IF(AND(ISNA(VLOOKUP(E11,INDIRECT(\"'\"&$K$1&\"'!$A$1:$H$550\"),5,FALSE)), ISNA(VLOOKUP(G11,INDIRECT(\"'\"&$K$1&\"'!$A$1:$H$550\"),5,FALSE))), \"0\", (IF(ISNA(VLOOKUP(E11,INDIRECT(\"'\"&$K$1&\"'!$A$1:$H$550\"),5,FALSE)), VLOOKUP(G11,INDIRECT(\"'\"&$K$1&\"'!$A$1:$H$550\"),5,FALSE), VLOOKUP(E11,INDIRECT(\"'\"&$K$1&\"'!$A$1:$H$550\"),5,FALSE))))","v":1}]
["COMP.2040","or","91.204",3,"COMP.2040","or","91.204","Spring2018",3]
["COMP.3010","or","91.301",3,"COMP.3010","or","91.301","Spring2019",3]
["COMP.3040","or","91.304",3,"COMP.3040","or","91.304","Fall2018",3]
["COMP.3050","or","91.305",3,"COMP.3050","or","91.305","Fall2018",3]
["COMP.3080","or","91.308",3,"COMP.3080","or","91.308","Spring2019",3]
["COMP.4040","or","91.404",3,"COMP.4040","or","91.404","Fall2019",3]
["Req. Bio/Cheminformatics Electives (BCIE)"]
["BCIE-1",null,null,3,{"$f":"IF(ISNA(INDEX(INDIRECT(\"'\"&$K$1&\"'!$A$1:$A$550\"), MATCH(A19,INDIRECT(\"'\"&$K$1&\"'!$B$1:$B$550\"),0))), \"Not Found\", (INDEX(INDIRECT(\"'\"&$K$1&\"'!$A$1:$A$550\"), MATCH(A19,INDIRECT(\"'\"&$K$1&\"'!$B$1:$B$550\"),0))))","v":"BCIE-1"},null,null,{"$f":"IF(ISNA(VLOOKUP(E19,INDIRECT(\"'\"&$K$1&\"'!$A$1:$H$550\"),8,FALSE)), \"Not Found\", VLOOKUP(E19,INDIRECT(\"'\"&$K$1&\"'!$A$1:$H$550\"),8,FALSE))","v":"Spring2019"},{"$f":"IF(ISNA(VLOOKUP(E19,INDIRECT(\"'\"&$K$1&\"'!$A$1:$H$550\"),5,FALSE)), \"0\", VLOOKUP(E19,INDIRECT(\"'\"&$K$1&\"'!$A$1:$H$550\"),5,FALSE))","v":3}]
["BCIE-2",null,null,3,{"$f":"IF(ISNA(INDEX(INDIRECT(\"'\"&$K$1&\"'!$A$1:$A$550\"), MATCH(A20,INDIRECT(\"'\"&$K$1&\"'!$B$1:$B$550\"),0))), \"Not Found\", (INDEX(INDIRECT(\"'\"&$K$1&\"'!$A$1:$A$550\"), MATCH(A20,INDIRECT(\"'\"&$K$1&\"'!$B$1:$B$550\"),0))))","v":"BCIE-2"},null,null,"Fall2019",3]
["BCIE-3",null,null,3,{"$f":"IF(ISNA(INDEX(INDIRECT(\"'\"&$K$1&\"'!$A$1:$A$550\"), MATCH(A21,INDIRECT(\"'\"&$K$1&\"'!$B$1:$B$550\"),0))), \"Not Found\", (INDEX(INDIRECT(\"'\"&$K$1&\"'!$A$1:$A$550\"), MATCH(A21,INDIRECT(\"'\"&$K$1&\"'!$B$1:$B$550\"),0))))","v":"BCIE-3"},null,null,{"$f":"IF(ISNA(VLOOKUP(E21,INDIRECT(\"'\"&$K$1&\"'!$A$1:$H$550\"),8,FALSE)), \"Not Found\", VLOOKUP(E21,INDIRECT(\"'\"&$K$1&\"'!$A$1:$H$550\"),8,FALSE))","v":"Spring2020"},{"$f":"IF(ISNA(VLOOKUP(E21,INDIRECT(\"'\"&$K$1&\"'!$A$1:$H$550\"),5,FALSE)), \"0\", VLOOKUP(E21,INDIRECT(\"'\"&$K$1&\"'!$A$1:$H$550\"),5,FALSE))","v":3}]
["CS Project Course"]
["Sr.Prj-1",null,null,3,{"$f":"IF(ISNA(INDEX(INDIRECT(\"'\"&$K$1&\"'!$A$1:$A$550\"), MATCH(A23,INDIRECT(\"'\"&$K$1&\"'!$B$1:$B$550\"),0))), \"Not Found\", (INDEX(INDIRECT(\"'\"&$K$1&\"'!$A$1:$A$550\"), MATCH(A23,INDIRECT(\"'\"&$K$1&\"'!$B$1:$B$550\"),0))))","v":"COMP.4xxx-p1"},null,null,"Fall2019",3]
["Sr.Prj-2",null,null,3,{"$f":"IF(ISNA(INDEX(INDIRECT(\"'\"&$K$1&\"'!$A$1:$A$550\"), MATCH(A24,INDIRECT(\"'\"&$K$1&\"'!$B$1:$B$550\"),0))), \"Not Found\", (INDEX(INDIRECT(\"'\"&$K$1&\"'!$A$1:$A$550\"), MATCH(A24,INDIRECT(\"'\"&$K$1&\"'!$B$1:$B$550\"),0))))","v":"COMP.4xxx-p2"},null,null,{"$f":"IF(ISNA(VLOOKUP(E24,INDIRECT(\"'\"&$K$1&\"'!$A$1:$H$550\"),8,FALSE)), \"Not Found\", VLOOKUP(E24,INDIRECT(\"'\"&$K$1&\"'!$A$1:$H$550\"),8,FALSE))","v":"Spring2020"},{"$f":"IF(ISNA(VLOOKUP(E24,INDIRECT(\"'\"&$K$1&\"'!$A$1:$H$550\"),5,FALSE)), \"0\", VLOOKUP(E24,INDIRECT(\"'\"&$K$1&\"'!$A$1:$H$550\"),5,FALSE))","v":3}]
[]
["Required Supporting Technical Courses"]
["Requirement",null,null,"Credits","Taken",null,null,"Semester","Credits"]
["Electrical Engineering"]
["EECE.2650","or","16.265",3,"EECE.2650","or","16.265",{"$f":"IF(AND(ISNA(VLOOKUP(E29,INDIRECT(\"'\"&$K$1&\"'!$A$1:$H$550\"),8,FALSE)), ISNA(VLOOKUP(G29,INDIRECT(\"'\"&$K$1&\"'!$A$1:$H$550\"),8,FALSE))), \"Not Found\", (IF(ISNA(VLOOKUP(E29,INDIRECT(\"'\"&$K$1&\"'!$A$1:$H$550\"),8,FALSE)), VLOOKUP(G29,INDIRECT(\"'\"&$K$1&\"'!$A$1:$H$550\"),8,FALSE), VLOOKUP(E29,INDIRECT(\"'\"&$K$1&\"'!$A$1:$H$550\"),8,FALSE))))","v":"Spring2018"},{"$f":"IF(AND(ISNA(VLOOKUP(E29,INDIRECT(\"'\"&$K$1&\"'!$A$1:$H$550\"),5,FALSE)), ISNA(VLOOKUP(G29,INDIRECT(\"'\"&$K$1&\"'!$A$1:$H$550\"),5,FALSE))), \"0\", (IF(ISNA(VLOOKUP(E29,INDIRECT(\"'\"&$K$1&\"'!$A$1:$H$550\"),5,FALSE)), VLOOKUP(G29,INDIRECT(\"'\"&$K$1&\"'!$A$1:$H$550\"),5,FALSE), VLOOKUP(E29,INDIRECT(\"'\"&$K$1&\"'!$A$1:$H$550\"),5,FALSE))))","v":3}]
["Mathematics"]
["MATH.1310","or","92.131",4,"MATH.1310","or","92.131",{"$f":"IF(AND(ISNA(VLOOKUP(E31,INDIRECT(\"'\"&$K$1&\"'!$A$1:$H$550\"),8,FALSE)), ISNA(VLOOKUP(G31,INDIRECT(\"'\"&$K$1&\"'!$A$1:$H$550\"),8,FALSE))), \"Not Found\", (IF(ISNA(VLOOKUP(E31,INDIRECT(\"'\"&$K$1&\"'!$A$1:$H$550\"),8,FALSE)), VLOOKUP(G31,INDIRECT(\"'\"&$K$1&\"'!$A$1:$H$550\"),8,FALSE), VLOOKUP(E31,INDIRECT(\"'\"&$K$1&\"'!$A$1:$H$550\"),8,FALSE))))","v":"Fall2016"},{"$f":"IF(AND(ISNA(VLOOKUP(E31,INDIRECT(\"'\"&$K$1&\"'!$A$1:$H$550\"),5,FALSE)), ISNA(VLOOKUP(G31,INDIRECT(\"'\"&$K$1&\"'!$A$1:$H$550\"),5,FALSE))), \"0\", (IF(ISNA(VLOOKUP(E31,INDIRECT(\"'\"&$K$1&\"'!$A$1:$H$550\"),5,FALSE)), VLOOKUP(G31,INDIRECT(\"'\"&$K$1&\"'!$A$1:$H$550\"),5,FALSE), VLOOKUP(E31,INDIRECT(\"'\"&$K$1&\"'!$A$1:$H$550\"),5,FALSE))))","v":4}]
["MATH.1320","or","92.132",4,"MATH.1320","or","92.132","Spring2017",4]
["MATH.3210","or","92.321",3,"MATH.3210","or","92.321","Fall2017",3]
["MATH.3220","or","92.322",3,"MATH.3220","or","92.322","Spring2018",3]
["MATH.3860","or","92.386",3,"MATH.3860","or","92.386","Fall2018",3]
["Biology"]
["BIOL.1110","or","81.111",3,"BIOL.1110","or","81.111",{"$f":"IF(AND(ISNA(VLOOKUP(E37,INDIRECT(\"'\"&$K$1&\"'!$A$1:$H$550\"),8,FALSE)), ISNA(VLOOKUP(G37,INDIRECT(\"'\"&$K$1&\"'!$A$1:$H$550\"),8,FALSE))), \"Not Found\", (IF(ISNA(VLOOKUP(E37,INDIRECT(\"'\"&$K$1&\"'!$A$1:$H$550\"),8,FALSE)), VLOOKUP(G37,INDIRECT(\"'\"&$K$1&\"'!$A$1:$H$550\"),8,FALSE), VLOOKUP(E37,INDIRECT(\"'\"&$K$1&\"'!$A$1:$H$550\"),8,FALSE))))","v":"Fall2016"},{"$f":"IF(AND(ISNA(VLOOKUP(E37,INDIRECT(\"'\"&$K$1&\"'!$A$1:$H$550\"),5,FALSE)), ISNA(VLOOKUP(G37,INDIRECT(\"'\"&$K$1&\"'!$A$1:$H$550\"),5,FALSE))), \"0\", (IF(ISNA(VLOOKUP(E37,INDIRECT(\"'\"&$K$1&\"'!$A$1:$H$550\"),5,FALSE)), VLOOKUP(G37,INDIRECT(\"'\"&$K$1&\"'!$A$1:$H$550\"),5,FALSE), VLOOKUP(E37,INDIRECT(\"'\"&$K$1&\"'!$A$1:$H$550\"),5,FALSE))))","v":3}]
["BIOL.1170L","or","81.117",1,"BIOL.1170L","or","81.117","Fall2016",1]
["BIOL.2350","or","81.235",3,"BIOL.2350","or","81.235","Fall2018",3]
["BIOL.2370","or","81.237",1,"BIOL.2370","or","81.237","Fall2018",1]
["Chemistry"]
["CHEM.1210","or","84.121",3,"CHEM.1210","or","84.121",{"$f":"IF(AND(ISNA(VLOOKUP(E42,INDIRECT(\"'\"&$K$1&\"'!$A$1:$H$550\"),8,FALSE)), ISNA(VLOOKUP(G42,INDIRECT(\"'\"&$K$1&\"'!$A$1:$H$550\"),8,FALSE))), \"Not Found\", (IF(ISNA(VLOOKUP(E42,INDIRECT(\"'\"&$K$1&\"'!$A$1:$H$550\"),8,FALSE)), VLOOKUP(G42,INDIRECT(\"'\"&$K$1&\"'!$A$1:$H$550\"),8,FALSE), VLOOKUP(E42,INDIRECT(\"'\"&$K$1&\"'!$A$1:$H$550\"),8,FALSE))))","v":"Fall2017"},{"$f":"IF(AND(ISNA(VLOOKUP(E42,INDIRECT(\"'\"&$K$1&\"'!$A$1:$H$550\"),5,FALSE)), ISNA(VLOOKUP(G42,INDIRECT(\"'\"&$K$1&\"'!$A$1:$H$550\"),5,FALSE))), \"0\", (IF(ISNA(VLOOKUP(E42,INDIRECT(\"'\"&$K$1&\"'!$A$1:$H$550\"),5,FALSE)), VLOOKUP(G42,INDIRECT(\"'\"&$K$1&\"'!$A$1:$H$550\"),5,FALSE), VLOOKUP(E42,INDIRECT(\"'\"&$K$1&\"'!$A$1:$H$550\"),5,FALSE))))","v":3}]
["CHEM.1230L","or","84.123",1,"CHEM.1230L","or","84.123","Fall2017",1]
["CHEM.1220","or","84.122",3,"CHEM.1220","or","84.122","Spring2018",3]
["CHEM.1240L","or","84.124",1,"CHEM.1240L","or","84.124","Spring2018",1]
[]
["Free Electives (FE)",null,null,null,null,null,null,null,null,null,null,"Free Electives"]
["Requirement",null,null,"Credits","Taken",null,null,"Semester","Credits",null,null,"List free electives you are interested in taking.  These cannot be below the level of a"]
["FE-1",null,null,3,{"$f":"IF(ISNA(INDEX(INDIRECT(\"'\"&$K$1&\"'!$A$1:$A$550\"), MATCH(\"*\"&A49&\"*\",INDIRECT(\"'\"&$K$1&\"'!$B$1:$B$550\"),0))), \"Not Found\", (INDEX(INDIRECT(\"'\"&$K$1&\"'!$A$1:$A$550\"), MATCH(\"*\"&A49&\"*\",INDIRECT(\"'\"&$K$1&\"'!$B$1:$B$550\"),0))))","v":"FE-1"},null,null,{"$f":"IF(ISNA(VLOOKUP(E49,INDIRECT(\"'\"&$K$1&\"'!$A$1:$H$550\"),8,FALSE)), \"Not Found\", VLOOKUP(E49,INDIRECT(\"'\"&$K$1&\"'!$A$1:$H$550\"),8,FALSE))","v":"Spring2019"},{"$f":"IF(ISNA(VLOOKUP(E49,INDIRECT(\"'\"&$K$1&\"'!$A$1:$H$550\"),5,FALSE)), \"0\", VLOOKUP(E49,INDIRECT(\"'\"&$K$1&\"'!$A$1:$H$550\"),5,FALSE))","v":3},null,null,"required course.  Specific courses may be recommended for different CS tracks."]
["FE-2",null,null,3,"FE-2",null,null,"Fall2019",3]
["FE-3",null,null,3,"FE-3",null,null,"Fall2019",3]
["FE-4",null,null,3,"FE-4",null,null,"Spring2020",3]
["Not Req.",null,null,"n/a","Not Found",null,null,{"$f":"IF(ISNA(VLOOKUP(E53,INDIRECT(\"'\"&$K$1&\"'!$A$1:$H$550\"),8,FALSE)), \"Not Found\", VLOOKUP(E53,INDIRECT(\"'\"&$K$1&\"'!$A$1:$H$550\"),8,FALSE))","v":"Not Found"},{"$f":"IF(ISNA(VLOOKUP(E53,INDIRECT(\"'\"&$K$1&\"'!$A$1:$H$550\"),5,FALSE)), \"0\", VLOOKUP(E53,INDIRECT(\"'\"&$K$1&\"'!$A$1:$H$550\"),5,FALSE))","v":"0"}]
["Not Req.",null,null,"n/a","Not Found",null,null,{"$f":"IF(ISNA(VLOOKUP(E54,INDIRECT(\"'\"&$K$1&\"'!$A$1:$H$550\"),8,FALSE)), \"Not Found\", VLOOKUP(E54,INDIRECT(\"'\"&$K$1&\"'!$A$1:$H$550\"),8,FALSE))","v":"Not Found"},{"$f":"IF(ISNA(VLOOKUP(E54,INDIRECT(\"'\"&$K$1&\"'!$A$1:$H$550\"),5,FALSE)), \"0\", VLOOKUP(E54,INDIRECT(\"'\"&$K$1&\"'!$A$1:$H$550\"),5,FALSE))","v":"0"}]
[]
["Required FE Credits",null,null,null,null,null,null,"Projected Credits"]
[null,null,null,{"$f":"121-SUM(D4:D45,D70,D71,D75:D81)","v":12},null,null,null,null,{"$f":"SUM(I49:I55)","v":12}]
[]
["Oral & Written Communication"]
["Requirement",null,null,"Credits","Taken",null,null,"Semester","Credits"]
["ENGL.2200","or","42.220",3,"ENGL.2200","or","42.220",{"$f":"IF(AND(ISNA(VLOOKUP(E61,INDIRECT(\"'\"&$K$1&\"'!$A$1:$H$550\"),8,FALSE)), ISNA(VLOOKUP(G61,INDIRECT(\"'\"&$K$1&\"'!$A$1:$H$550\"),8,FALSE))), \"Not Found\", (IF(ISNA(VLOOKUP(E61,INDIRECT(\"'\"&$K$1&\"'!$A$1:$H$550\"),8,FALSE)), VLOOKUP(G61,INDIRECT(\"'\"&$K$1&\"'!$A$1:$H$550\"),8,FALSE), VLOOKUP(E61,INDIRECT(\"'\"&$K$1&\"'!$A$1:$H$550\"),8,FALSE))))","v":"Spring2019"},{"$f":"IF(AND(ISNA(VLOOKUP(E61,INDIRECT(\"'\"&$K$1&\"'!$A$1:$H$550\"),5,FALSE)), ISNA(VLOOKUP(G61,INDIRECT(\"'\"&$K$1&\"'!$A$1:$H$550\"),5,FALSE))), \"0\", (IF(ISNA(VLOOKUP(E61,INDIRECT(\"'\"&$K$1&\"'!$A$1:$H$550\"),5,FALSE)), VLOOKUP(G61,INDIRECT(\"'\"&$K$1&\"'!$A$1:$H$550\"),5,FALSE), VLOOKUP(E61,INDIRECT(\"'\"&$K$1&\"'!$A$1:$H$550\"),5,FALSE))))","v":3}]
[]
["CS Ethics Requirement"]
["Requirement",null,null,"Credits","Taken",null,null,"Semester","Credits"]
["CSET",null,null,3,{"$f":"IF(ISNA(INDEX(INDIRECT(\"'\"&$K$1&\"'!$A$1:$A$550\"), MATCH(A65,INDIRECT(\"'\"&$K$1&\"'!$C$1:$C$550\"),0))), \"Not Found\", (INDEX(INDIRECT(\"'\"&$K$1&\"'!$A$1:$A$550\"), MATCH(A65,INDIRECT(\"'\"&$K$1&\"'!$C$1:$C$550\"),0))))","v":"CSET"},null,null,{"$f":"IF(ISNA(VLOOKUP(E65,INDIRECT(\"'\"&$K$1&\"'!$A$1:$H$550\"),8,FALSE)), \"Not Found\", VLOOKUP(E65,INDIRECT(\"'\"&$K$1&\"'!$A$1:$H$550\"),8,FALSE))","v":"Fall2018"},{"$f":"IF(ISNA(VLOOKUP(E65,INDIRECT(\"'\"&$K$1&\"'!$A$1:$H$550\"),5,FALSE)), \"0\", VLOOKUP(E65,INDIRECT(\"'\"&$K$1&\"'!$A$1:$H$550\"),5,FALSE))","v":3}]
[]
["Breadth of Knowledge",null,null,null,null,null,null,null,null,null,null," Breadth of Knowledge Requirements"]
["Requirement",null,null,"Credits","Taken",null,null,"Semester","Credits",null,null,"Select courses you are interested in taking to satisfy this Requirements."]
["College Writing",null,null,null,null,null,null,null,null,null,null,"Area","Title"]
["CW-1",null,null,3,{"$f":"IF(ISNA(INDEX(INDIRECT(\"'\"&$K$1&\"'!$A$1:$A$550\"), MATCH(A70,INDIRECT(\"'\"&$K$1&\"'!$B$1:$B$550\"),0))), \"Not Found\", (INDEX(INDIRECT(\"'\"&$K$1&\"'!$A$1:$A$550\"), MATCH(A70,INDIRECT(\"'\"&$K$1&\"'!$B$1:$B$550\"),0))))","v":"ENGL.1010"},null,null,{"$f":"IF(ISNA(VLOOKUP(E70,INDIRECT(\"'\"&$K$1&\"'!$A$1:$H$550\"),8,FALSE)), \"Not Found\", VLOOKUP(E70,INDIRECT(\"'\"&$K$1&\"'!$A$1:$H$550\"),8,FALSE))","v":"Transfer/AP"},{"$f":"IF(ISNA(VLOOKUP(E70,INDIRECT(\"'\"&$K$1&\"'!$A$1:$H$550\"),5,FALSE)), \"0\", VLOOKUP(E70,INDIRECT(\"'\"&$K$1&\"'!$A$1:$H$550\"),5,FALSE))","v":3}]
["CW-2",null,null,3,{"$f":"IF(ISNA(INDEX(INDIRECT(\"'\"&$K$1&\"'!$A$1:$A$550\"), MATCH(A71,INDIRECT(\"'\"&$K$1&\"'!$B$1:$B$550\"),0))), \"Not Found\", (INDEX(INDIRECT(\"'\"&$K$1&\"'!$A$1:$A$550\"), MATCH(A71,INDIRECT(\"'\"&$K$1&\"'!$B$1:$B$550\"),0))))","v":"ENGL.1020"},null,null,"Fall2016",3]
["Mathematics"]
["MA",null,null,4,{"$f":"IF(ISNA(INDEX(INDIRECT(\"'\"&$K$1&\"'!$A$1:$A$550\"), MATCH(A73,INDIRECT(\"'\"&$K$1&\"'!$B$1:$B$550\"),0))), \"Not Found\", (INDEX(INDIRECT(\"'\"&$K$1&\"'!$A$1:$A$550\"), MATCH(A73,INDIRECT(\"'\"&$K$1&\"'!$B$1:$B$550\"),0))))","v":"MATH.1310"},null,null,{"$f":"IF(ISNA(VLOOKUP(E73,INDIRECT(\"'\"&$K$1&\"'!$A$1:$H$550\"),8,FALSE)), \"Not Found\", VLOOKUP(E73,INDIRECT(\"'\"&$K$1&\"'!$A$1:$H$550\"),8,FALSE))","v":"Fall2016"},{"$f":"IF(ISNA(VLOOKUP(E73,INDIRECT(\"'\"&$K$1&\"'!$A$1:$H$550\"),5,FALSE)), \"0\", VLOOKUP(E73,INDIRECT(\"'\"&$K$1&\"'!$A$1:$H$550\"),5,FALSE))","v":4}]
["Arts & Humanities"]
["AH-1",null,null,3,{"$f":"IF(ISNA(INDEX(INDIRECT(\"'\"&$K$1&\"'!$A$1:$A$550\"), MATCH(\"*\"&A75&\"*\",INDIRECT(\"'\"&$K$1&\"'!$B$1:$B$550\"),0))), \"Not Found\", (INDEX(INDIRECT(\"'\"&$K$1&\"'!$A$1:$A$550\"), MATCH(\"*\"&A75&\"*\",INDIRECT(\"'\"&$K$1&\"'!$B$1:$B$550\"),0))))","v":"CSET"},null,null,{"$f":"IF(ISNA(VLOOKUP(E75,INDIRECT(\"'\"&$K$1&\"'!$A$1:$H$550\"),8,FALSE)), \"Not Found\", VLOOKUP(E75,INDIRECT(\"'\"&$K$1&\"'!$A$1:$H$550\"),8,FALSE))","v":"Fall2018"},{"$f":"IF(ISNA(VLOOKUP(E75,INDIRECT(\"'\"&$K$1&\"'!$A$1:$H$550\"),5,FALSE)), \"0\", VLOOKUP(E75,INDIRECT(\"'\"&$K$1&\"'!$A$1:$H$550\"),5,FALSE))","v":3}]
["AH-2",null,null,3,{"$f":"IF(ISNA(INDEX(INDIRECT(\"'\"&$K$1&\"'!$A$1:$A$550\"), MATCH(\"*\"&A76&\"*\",INDIRECT(\"'\"&$K$1&\"'!$B$1:$B$550\"),0))), \"Not Found\", (INDEX(INDIRECT(\"'\"&$K$1&\"'!$A$1:$A$550\"), MATCH(\"*\"&A76&\"*\",INDIRECT(\"'\"&$K$1&\"'!$B$1:$B$550\"),0))))","v":"ENGL.2200"},null,null,"Spring2019",3]
["AH-3",null,null,3,{"$f":"IF(ISNA(INDEX(INDIRECT(\"'\"&$K$1&\"'!$A$1:$A$550\"), MATCH(\"*\"&A77&\"*\",INDIRECT(\"'\"&$K$1&\"'!$B$1:$B$550\"),0))), \"Not Found\", (INDEX(INDIRECT(\"'\"&$K$1&\"'!$A$1:$A$550\"), MATCH(\"*\"&A77&\"*\",INDIRECT(\"'\"&$K$1&\"'!$B$1:$B$550\"),0))))","v":"AH-3"},null,null,"Spring2020",3]
["Social Sciences"]
["SS-1",null,null,3,{"$f":"IF(ISNA(INDEX(INDIRECT(\"'\"&$K$1&\"'!$A$1:$A$550\"), MATCH(\"*\"&A79&\"*\",INDIRECT(\"'\"&$K$1&\"'!$B$1:$B$550\"),0))), \"Not Found\", (INDEX(INDIRECT(\"'\"&$K$1&\"'!$A$1:$A$550\"), MATCH(\"*\"&A79&\"*\",INDIRECT(\"'\"&$K$1&\"'!$B$1:$B$550\"),0))))","v":"ECON.2020"},null,null,{"$f":"IF(ISNA(VLOOKUP(E79,INDIRECT(\"'\"&$K$1&\"'!$A$1:$H$550\"),8,FALSE)), \"Not Found\", VLOOKUP(E79,INDIRECT(\"'\"&$K$1&\"'!$A$1:$H$550\"),8,FALSE))","v":"Transfer/AP"},{"$f":"IF(ISNA(VLOOKUP(E79,INDIRECT(\"'\"&$K$1&\"'!$A$1:$H$550\"),5,FALSE)), \"0\", VLOOKUP(E79,INDIRECT(\"'\"&$K$1&\"'!$A$1:$H$550\"),5,FALSE))","v":3}]
["SS-2",null,null,3,{"$f":"IF(ISNA(INDEX(INDIRECT(\"'\"&$K$1&\"'!$A$1:$A$550\"), MATCH(\"*\"&A80&\"*\",INDIRECT(\"'\"&$K$1&\"'!$B$1:$B$550\"),0))), \"Not Found\", (INDEX(INDIRECT(\"'\"&$K$1&\"'!$A$1:$A$550\"), MATCH(\"*\"&A80&\"*\",INDIRECT(\"'\"&$K$1&\"'!$B$1:$B$550\"),0))))","v":"SOCI.2320"},null,null,"Spring2017",3]
["SS-3",null,null,3,{"$f":"IF(ISNA(INDEX(INDIRECT(\"'\"&$K$1&\"'!$A$1:$A$550\"), MATCH(\"*\"&A81&\"*\",INDIRECT(\"'\"&$K$1&\"'!$B$1:$B$550\"),0))), \"Not Found\", (INDEX(INDIRECT(\"'\"&$K$1&\"'!$A$1:$A$550\"), MATCH(\"*\"&A81&\"*\",INDIRECT(\"'\"&$K$1&\"'!$B$1:$B$550\"),0))))","v":"Gen-Ed"},null,null,"Spring2017",3]
["Sciences with Lab"]
["SC-1",null,null,3,{"$f":"IF(ISNA(INDEX(INDIRECT(\"'\"&$K$1&\"'!$A$1:$A$550\"), MATCH(A83,INDIRECT(\"'\"&$K$1&\"'!$B$1:$B$550\"),0))), \"Not Found\", (INDEX(INDIRECT(\"'\"&$K$1&\"'!$A$1:$A$550\"), MATCH(A83,INDIRECT(\"'\"&$K$1&\"'!$B$1:$B$550\"),0))))","v":"CHEM.1210"},null,null,{"$f":"IF(ISNA(VLOOKUP(E83,INDIRECT(\"'\"&$K$1&\"'!$A$1:$H$550\"),8,FALSE)), \"Not Found\", VLOOKUP(E83,INDIRECT(\"'\"&$K$1&\"'!$A$1:$H$550\"),8,FALSE))","v":"Fall2017"},{"$f":"IF(ISNA(VLOOKUP(E83,INDIRECT(\"'\"&$K$1&\"'!$A$1:$H$550\"),5,FALSE)), \"0\", VLOOKUP(E83,INDIRECT(\"'\"&$K$1&\"'!$A$1:$H$550\"),5,FALSE))","v":3}]
["SCL-1",null,null,1,{"$f":"IF(ISNA(INDEX(INDIRECT(\"'\"&$K$1&\"'!$A$1:$A$550\"), MATCH(A84,INDIRECT(\"'\"&$K$1&\"'!$B$1:$B$550\"),0))), \"Not Found\", (INDEX(INDIRECT(\"'\"&$K$1&\"'!$A$1:$A$550\"), MATCH(A84,INDIRECT(\"'\"&$K$1&\"'!$B$1:$B$550\"),0))))","v":"CHEM.1230L"},null,null,"Fall2017",1]
["SC-2",null,null,3,{"$f":"IF(ISNA(INDEX(INDIRECT(\"'\"&$K$1&\"'!$A$1:$A$550\"), MATCH(A85,INDIRECT(\"'\"&$K$1&\"'!$B$1:$B$550\"),0))), \"Not Found\", (INDEX(INDIRECT(\"'\"&$K$1&\"'!$A$1:$A$550\"), MATCH(A85,INDIRECT(\"'\"&$K$1&\"'!$B$1:$B$550\"),0))))","v":"CHEM.1220"},null,null,"Spring2018",3]
["SCL-2",null,null,1,{"$f":"IF(ISNA(INDEX(INDIRECT(\"'\"&$K$1&\"'!$A$1:$A$550\"), MATCH(A86,INDIRECT(\"'\"&$K$1&\"'!$B$1:$B$550\"),0))), \"Not Found\", (INDEX(INDIRECT(\"'\"&$K$1&\"'!$A$1:$A$550\"), MATCH(A86,INDIRECT(\"'\"&$K$1&\"'!$B$1:$B$550\"),0))))","v":"CHEM.1240L"},null,null,"Spring2018",1]
["STEM"]
["STEM",null,null,3,{"$f":"IF(ISNA(INDEX(INDIRECT(\"'\"&$K$1&\"'!$A$1:$A$550\"), MATCH(A88,INDIRECT(\"'\"&$K$1&\"'!$B$1:$B$550\"),0))), \"Not Found\", (INDEX(INDIRECT(\"'\"&$K$1&\"'!$A$1:$A$550\"), MATCH(A88,INDIRECT(\"'\"&$K$1&\"'!$B$1:$B$550\"),0))))","v":"BIOL.2350"},null,null,{"$f":"IF(ISNA(VLOOKUP(E88,INDIRECT(\"'\"&$K$1&\"'!$A$1:$H$550\"),8,FALSE)), \"Not Found\", VLOOKUP(E88,INDIRECT(\"'\"&$K$1&\"'!$A$1:$H$550\"),8,FALSE))","v":"Fall2018"},{"$f":"IF(ISNA(VLOOKUP(E88,INDIRECT(\"'\"&$K$1&\"'!$A$1:$H$550\"),5,FALSE)), \"0\", VLOOKUP(E88,INDIRECT(\"'\"&$K$1&\"'!$A$1:$H$550\"),5,FALSE))","v":3}]
[]
["Diversity & Ethics ELOs"]
["Diversity & Cultural Awareness (DV)"]
["DV",null,null,3,{"$f":"IF(ISNA(INDEX(INDIRECT(\"'\"&$K$1&\"'!$A$1:$A$550\"), MATCH(\"*\"&A92&\"*\",INDIRECT(\"'\"&$K$1&\"'!$B$1:$B$550\"),0))), \"Not Found\", (INDEX(INDIRECT(\"'\"&$K$1&\"'!$A$1:$A$550\"), MATCH(\"*\"&A92&\"*\",INDIRECT(\"'\"&$K$1&\"'!$B$1:$B$550\"),0))))","v":"SOCI.2320"},null,null,{"$f":"IF(ISNA(VLOOKUP(E92,INDIRECT(\"'\"&$K$1&\"'!$A$1:$H$550\"),8,FALSE)), \"Not Found\", VLOOKUP(E92,INDIRECT(\"'\"&$K$1&\"'!$A$1:$H$550\"),8,FALSE))","v":"Spring2017"},{"$f":"IF(ISNA(VLOOKUP(E92,INDIRECT(\"'\"&$K$1&\"'!$A$1:$H$550\"),5,FALSE)), \"0\", VLOOKUP(E92,INDIRECT(\"'\"&$K$1&\"'!$A$1:$H$550\"),5,FALSE))","v":3}]
["Social Responsibility & Ethics (ET)"]
["ET",null,null,3,{"$f":"IF(ISNA(INDEX(INDIRECT(\"'\"&$K$1&\"'!$A$1:$A$550\"), MATCH(\"*\"&A94&\"*\",INDIRECT(\"'\"&$K$1&\"'!$B$1:$B$550\"),0))), \"Not Found\", (INDEX(INDIRECT(\"'\"&$K$1&\"'!$A$1:$A$550\"), MATCH(\"*\"&A94&\"*\",INDIRECT(\"'\"&$K$1&\"'!$B$1:$B$550\"),0))))","v":"CSET"},null,null,{"$f":"IF(ISNA(VLOOKUP(E94,INDIRECT(\"'\"&$K$1&\"'!$A$1:$H$550\"),8,FALSE)), \"Not Found\", VLOOKUP(E94,INDIRECT(\"'\"&$K$1&\"'!$A$1:$H$550\"),8,FALSE))","v":"Fall2018"},{"$f":"IF(ISNA(VLOOKUP(E94,INDIRECT(\"'\"&$K$1&\"'!$A$1:$H$550\"),5,FALSE)), \"0\", VLOOKUP(E94,INDIRECT(\"'\"&$K$1&\"'!$A$1:$H$550\"),5,FALSE))","v":3}]
[]
["Degree Credits",null,null,null,null,null,null,null,"Projected Degree Credits "]
[null,null,null,{"$f":"SUM(D4:D45,D57,D70,D71,D75:D81)","v":121},null,null,null,null,{"$f":"SUM(I4:I45,I57,I70,I71,I75:I81)","v":121}]

{"sheet":"Graduation_Plan","index":7,"n_rows":399,"n_cols":8,"rows_kept":399,"cut":false,"hidden":true,"merged":[[323,2,323,5],[310,0,310,6],[321,0,321,6],[296,2,296,5],[311,2,311,5],[322,0,322,5],[246,2,246,5],[261,2,261,5],[272,0,272,5],[273,2,273,5],[288,2,288,5],[260,0,260,6],[271,0,271,6],[287,0,287,6],[3,0,3,1],[3,2,3,5],[0,0,0,5],[1,0,1,1],[1,2,1,5],[2,0,2,1],[2,2,2,5],[4,0,4,1],[4,2,4,5],[5,0,5,1],[5,2,5,5],[6,0,6,1],[6,2,6,5],[13,0,13,6],[7,0,7,1],[7,2,7,5],[8,0,8,1],[8,2,8,5],[9,0,9,1],[9,2,9,5],[10,0,10,6],[11,0,11,3],[11,4,11,5],[12,0,12,3],[12,4,12,5],[14,0,14,3],[15,0,15,6],[16,0,16,5],[69,0,69,2],[70,0,70,2],[71,0,71,6],[72,0,72,5],[87,0,87,6],[17,0,17,5],[73,2,73,5],[88,2,88,5],[96,2,96,5],[110,0,110,6],[121,0,121,6],[137,0,137,6],[111,2,111,5],[122,0,122,5],[123,2,123,5],[138,2,138,5],[173,2,173,6],[187,0,187,6],[210,0,210,6],[221,0,221,6],[146,2,146,5],[161,2,161,5],[172,0,172,5],[188,2,188,5],[196,2,196,5],[160,0,160,6],[171,0,171,6],[237,0,237,6],[211,2,211,5],[222,0,222,5],[223,2,223,5],[238,2,238,5],[379,1,380,3],[379,4,380,4],[337,0,337,6],[360,0,360,6],[371,0,371,6],[373,1,373,4],[375,1,376,3],[375,4,376,4],[377,1,377,3],[338,2,338,5],[346,2,346,5],[361,2,361,5],[399,1,399,4],[381,1,381,3],[383,1,384,3],[383,4,384,4],[385,1,385,3],[387,1,388,3],[387,4,388,4],[389,1,389,3],[391,1,392,3],[391,4,392,4],[393,1,393,3],[398,1,398,4]]}
["Computer Science Graduation Plan"]
["Student Name",null,"Last Name, First Name"]
["University Id (not ss#)"]
["Email"]
["Primary Major (Option)",null,"Computer Science (General Option)"]
["Second Major:"]
["Third Major:"]
["Minors(s):"]
["Special Program(s):"]
["Scholarships:"]
[]
["Matriculation Date (Month/Year)",null,null,null,"Sept. 2016"]
["Expected Graduation Date (Month/Year)",null,null,null,"June 2020"]
[]
["Minimum Number of Credits Required for Degree(s)",null,null,null,120]
[]
["Transfer and AP Credits"]
[]
["Course","Req.","Req.","Course Title","Credits","Grade","Degree Credits","SemesterYear"]
[null,null,null,null,null,null,null,"Transfer/AP"]
[null,null,null,null,null,null,null,"Transfer/AP"]
[null,null,null,null,null,null,null,"Transfer/AP"]
[null,null,null,null,null,null,null,"Transfer/AP"]
[null,null,null,null,null,null,null,"Transfer/AP"]
[null,null,null,null,null,null,null,"Transfer/AP"]
[null,null,null,null,null,null,null,"Transfer/AP"]
[null,null,null,null,null,null,null,"Transfer/AP"]
[null,null,null,null,null,null,null,"Transfer/AP"]
[null,null,null,null,null,null,null,"Transfer/AP"]
[null,null,null,null,null,null,null,"Transfer/AP"]
[null,null,null,null,null,null,null,"Transfer/AP"]
[null,null,null,null,null,null,null,"Transfer/AP"]
[null,null,null,null,null,null,null,"Transfer/AP"]
[null,null,null,null,null,null,null,"Transfer/AP"]
[null,null,null,null,null,null,null,"Transfer/AP"]
[null,null,null,null,null,null,null,"Transfer/AP"]
[null,null,null,null,null,null,null,"Transfer/AP"]
[null,null,null,null,null,null,null,"Transfer/AP"]
[null,null,null,null,null,null,null,"Transfer/AP"]
[null,null,null,null,null,null,null,"Transfer/AP"]
[null,null,null,null,null,null,null,"Transfer/AP"]
[null,null,null,null,null,null,null,"Transfer/AP"]
[null,null,null,null,null,null,null,"Transfer/AP"]
[null,null,null,null,null,null,null,"Transfer/AP"]
[null,null,null,null,null,null,null,"Transfer/AP"]
[null,null,null,null,null,null,null,"Transfer/AP"]
[null,null,null,null,null,null,null,"Transfer/AP"]
[null,null,null,null,null,null,null,"Transfer/AP"]
[null,null,null,null,null,null,null,"Transfer/AP"]
[null,null,null,null,null,null,null,"Transfer/AP"]
[null,null,null,null,null,null,null,"Transfer/AP"]
[null,null,null,null,null,null,null,"Transfer/AP"]
[null,null,null,null,null,null,null,"Transfer/AP"]
[null,null,null,null,null,null,null,"Transfer/AP"]
[null,null,null,null,null,null,null,"Transfer/AP"]
[null,null,null,null,null,null,null,"Transfer/AP"]
[null,null,null,null,null,null,null,"Transfer/AP"]
[null,null,null,null,null,null,null,"Transfer/AP"]
[null,null,null,null,null,null,null,"Transfer/AP"]
[null,null,null,null,null,null,null,"Transfer/AP"]
[null,null,null,null,null,null,null,"Transfer/AP"]
[null,null,null,null,null,null,null,"Transfer/AP"]
[null,null,null,null,null,null,null,"Transfer/AP"]
[null,null,null,null,null,null,null,"Transfer/AP"]
[null,null,null,null,null,null,null,"Transfer/AP"]
[null,null,null,null,null,null,null,"Transfer/AP"]
[null,null,null,null,null,null,null,"Transfer/AP"]
[null,null,null,null,null,null,null,"Transfer/AP"]
[null,null,null,null,null,null,null,"Transfer/AP"]
[" "," ",null,"Transfer and AP Credits",{"$f":"SUM(E20:E69)","v":0},null,{"$f":"SUM(G20:G69)","v":0}]
[" "," ",null,"Total Credits Earned",{"$f":"E70","v":0},null,{"$f":"E15-G70","v":120}]
[]
["Year 1"]
["Fall","2016",{"$f":"C2","v":"Last Name, First Name"}]
["Course",{"$f":"B19","v":"Req."},{"$f":"C19","v":"Req."},"Course Title","Credits","Grade","Degree Credits","SemesterYear"]
[null,null,null,null,null,null,null,{"$f":"$A$74&$B$74","v":"Fall2016"}]
[null,null,null,null,null,null,null,{"$f":"$A$74&$B$74","v":"Fall2016"}]
[null,null,null,null,null,null,null,"Fall2016"]
[null,null,null,null,null,null,null,"Fall2016"]
[null,null,null,null,null,null,null,"Fall2016"]
[null,null,null,null,null,null,null,"Fall2016"]
[null,null,null,null,null,null,null,"Fall2016"]
[null,null,null,null,null,null,null,"Fall2016"]
[null,null,null,null,null,null,null,"Fall2016"]
[null,null,null,null,null,null,null,"Fall2016"]
[" "," ",null,"Semester Credits Earned",{"$f":"SUM(E76:E85)","v":0},null,{"$f":"SUM(G76:G85)","v":0}]
[" "," ",null,{"$f":"D71","v":"Total Credits Earned"},{"$f":"E71+E86","v":0},null,{"$f":"G71-G86","v":120}]
[]
["Winter",{"$f":"B74+1","v":2017},{"$f":"C2","v":"Last Name, First Name"}]
["Course",{"$f":"B19","v":"Req."},null,"Course Title","Credits","Grade","Degree Credits","SemesterYear"]
[null,null,null,null,null,null,null,{"$f":"$A$89&$B$89","v":"Winter2017"}]
[null,null,null,null,null,null,null,{"$f":"$A$89&$B$89","v":"Winter2017"}]
[null,null,null,null,null,null,null,"Winter2017"]
[" "," ",null,{"$f":"D86","v":"Semester Credits Earned"},{"$f":"SUM(E91:E93)","v":0},null,{"$f":"SUM(G91:G93)","v":0}]
[" "," ",null,{"$f":"D71","v":"Total Credits Earned"},{"$f":"E87+E94","v":0},null,{"$f":"G87-G94","v":120}]
[]
["Spring",{"$f":"B74+1","v":2017},{"$f":"C2","v":"Last Name, First Name"}]
["Course",{"$f":"B19","v":"Req."},{"$f":"C19","v":"Req."},"Course Title","Credits","Grade","Degree Credits","SemesterYear"]
[null,null,null,null,null,null,null,{"$f":"$A$97&$B$97","v":"Spring2017"}]
[null,null,null,null,null,null,null,{"$f":"$A$97&$B$97","v":"Spring2017"}]
[null,null,null,null,null,null,null,"Spring2017"]
[null,null,null,null,null,null,null,"Spring2017"]
[null,null,null,null,null,null,null,"Spring2017"]
[null,null,null,null,null,null,null,"Spring2017"]
[null,null,null,null,null,null,null,"Spring2017"]
[null,null,null,null,null,null,null,"Spring2017"]
[null,null,null,null,null,null,null,"Spring2017"]
[null,null,null,null,null,null,null,"Spring2017"]
[" "," ",null,{"$f":"D86","v":"Semester Credits Earned"},{"$f":"SUM(E99:E108)","v":0},null,{"$f":"SUM(G99:G108)","v":0}]
[" "," ",null,{"$f":"D71","v":"Total Credits Earned"},{"$f":"E95+E109","v":0},null,{"$f":"G95-G109","v":120}]
[]
["Summer",{"$f":"B74+1","v":2017},{"$f":"C2","v":"Last Name, First Name"}]
["Course",{"$f":"B19","v":"Req."},{"$f":"C19","v":"Req."},"Course Title","Credits","Grade","Degree Credits","SemesterYear"]
[null,null,null,null,null,null,null,{"$f":"$A$112&$B$112","v":"Summer2017"}]
[null,null,null,null,null,null,null,{"$f":"$A$112&$B$112","v":"Summer2017"}]
[null,null,null,null,null,null,null,"Summer2017"]
[null,null,null,null,null,null,null,"Summer2017"]
[null,null,null,null,null,null,null,"Summer2017"]
[null,null,null,null,null,null,null,"Summer2017"]
[" "," ",null,{"$f":"D86","v":"Semester Credits Earned"},{"$f":"SUM(E114:E119)","v":0},null,{"$f":"SUM(G114:G119)","v":0}]
[" "," ",null,{"$f":"D71","v":"Total Credits Earned"},{"$f":"E110+E120","v":0},null,{"$f":"G110-G120","v":120}]
[]
["Year 2"]
["Fall",{"$f":"B74+1","v":2017},{"$f":"C2","v":"Last Name, First Name"}]
["Course",{"$f":"B19","v":"Req."},{"$f":"C19","v":"Req."},"Course Title","Credits","Grade","Degree Credits","SemesterYear"]
[null,null,null,null,null,null,null,{"$f":"$A$124&$B$124","v":"Fall2017"}]
[null,null,null,null,null,null,null,{"$f":"$A$124&$B$124","v":"Fall2017"}]
[null,null,null,null,null,null,null,"Fall2017"]
[null,null,null,null,null,null,null,"Fall2017"]
[null,null,null,null,null,null,null,"Fall2017"]
[null,null,null,null,null,null,null,"Fall2017"]
[null,null,null,null,null,null,null,"Fall2017"]
[null,null,null,null,null,null,null,"Fall2017"]
[null,null,null,null,null,null,null,"Fall2017"]
[null,null,null,null,null,null,null,"Fall2017"]
[" "," ",null,{"$f":"D86","v":"Semester Credits Earned"},{"$f":"SUM(E126:E135)","v":0},null,{"$f":"SUM(G126:G135)","v":0}]
[" "," ",null,{"$f":"D71","v":"Total Credits Earned"},{"$f":"E121+E136","v":0},null,{"$f":"G121-G136","v":120}]
[]
["Winter",{"$f":"B74+2","v":2018},{"$f":"C2","v":"Last Name, First Name"}]
["Course",{"$f":"B19","v":"Req."},{"$f":"C19","v":"Req."},"Course Title","Credits","Grade","Degree Credits","SemesterYear"]
[null,null,null,null,null,null,null,{"$f":"$A$139&$B$139","v":"Winter2018"}]
[null,null,null,null,null,null,null,{"$f":"$A$139&$B$139","v":"Winter2018"}]
[null,null,null,null,null,null,null,"Winter2018"]
[" "," ",null,{"$f":"D86","v":"Semester Credits Earned"},{"$f":"SUM(E141:E143)","v":0},null,{"$f":"SUM(G141:G143)","v":0}]
[" "," ",null,{"$f":"D71","v":"Total Credits Earned"},{"$f":"E137+E144","v":0},null,{"$f":"G137-G144","v":120}]
[]
["Spring",{"$f":"B89+1","v":2018},{"$f":"C2","v":"Last Name, First Name"}]
["Course",{"$f":"B19","v":"Req."},{"$f":"C19","v":"Req."},"Course Title","Credits","Grade","Degree Credits","SemesterYear"]
[null,null,null,null,null,null,null,{"$f":"$A$147&$B$147","v":"Spring2018"}]
[null,null,null,null,null,null,null,{"$f":"$A$147&$B$147","v":"Spring2018"}]
[null,null,null,null,null,null,null,"Spring2018"]
[null,null,null,null,null,null,null,"Spring2018"]
[null,null,null,null,null,null,null,"Spring2018"]
[null,null,null,null,null,null,null,"Spring2018"]
[null,null,null,null,null,null,null,"Spring2018"]
[null,null,null,null,null,null,null,"Spring2018"]
[null,null,null,null,null,null,null,"Spring2018"]
[null,null,null,null,null,null,null,"Spring2018"]
[" "," ",null,{"$f":"D86","v":"Semester Credits Earned"},{"$f":"SUM(E149:E158)","v":0},null,{"$f":"SUM(G149:G158)","v":0}]
[" "," ",null,{"$f":"D71","v":"Total Credits Earned"},{"$f":"E145+E159","v":0},null,{"$f":"G145-G159","v":120}]
[]
["Summer",{"$f":"B74+2","v":2018},{"$f":"C2","v":"Last Name, First Name"}]
["Course",{"$f":"B19","v":"Req."},{"$f":"C19","v":"Req."},"Course Title","Credits","Grade","Degree Credits","SemesterYear"]
[null,null,null,null,null,null,null,{"$f":"$A$162&$B$162","v":"Summer2018"}]
[null,null,null,null,null,null,null,{"$f":"$A$162&$B$162","v":"Summer2018"}]
[null,null,null,null,null,null,null,"Summer2018"]
[null,null,null,null,null,null,null,"Summer2018"]
[null,null,null,null,null,null,null,"Summer2018"]
[null,null,null,null,null,null,null,"Summer2018"]
[" "," ",null,{"$f":"D86","v":"Semester Credits Earned"},{"$f":"SUM(E164:E169)","v":0},null,{"$f":"SUM(G163:G169)","v":0}]
[" "," ",null,{"$f":"D71","v":"Total Credits Earned"},{"$f":"E160+E170","v":0},null,{"$f":"G160-G170","v":120}]
[]
["Year 3"]
["Fall",{"$f":"B74+2","v":2018},{"$f":"C2","v":"Last Name, First Name"}]
["Course",{"$f":"B19","v":"Req."},{"$f":"C19","v":"Req."},"Course Title","Credits","Grade","Degree Credits","SemesterYear"]
[null,null,null,null,null,null,null,{"$f":"$A$174&$B$174","v":"Fall2018"}]
[null,null,null,null,null,null,null,{"$f":"$A$174&$B$174","v":"Fall2018"}]
[null,null,null,null,null,null,null,"Fall2018"]
[null,null,null,null,null,null,null,"Fall2018"]
[null,null,null,null,null,null,null,"Fall2018"]
[null,null,null,null,null,null,null,"Fall2018"]
[null,null,null,null,null,null,null,"Fall2018"]
[null,null,null,null,null,null,null,"Fall2018"]
[null,null,null,null,null,null,null,"Fall2018"]
[null,null,null,null,null,null,null,"Fall2018"]
[" "," ",null,{"$f":"D86","v":"Semester Credits Earned"},{"$f":"SUM(E176:E185)","v":0},null,{"$f":"SUM(G176:G185)","v":0}]
[" "," ",null,{"$f":"D71","v":"Total Credits Earned"},{"$f":"E171+E186","v":0},null,{"$f":"G171-G186","v":120}]
[]
["Winter",{"$f":"B74+3","v":2019},{"$f":"C2","v":"Last Name, First Name"}]
["Course",{"$f":"B19","v":"Req."},{"$f":"C19","v":"Req."},"Course Title","Credits","Grade","Degree Credits","SemesterYear"]
[null,null,null,null,null,null,null,{"$f":"$A$189&$B$189","v":"Winter2019"}]
[null,null,null,null,null,null,null,{"$f":"$A$189&$B$189","v":"Winter2019"}]
[null,null,null,null,null,null,null,"Winter2019"]
[" "," ",null,{"$f":"D86","v":"Semester Credits Earned"},{"$f":"SUM(E191:E193)","v":0},null,{"$f":"SUM(G191:G193)","v":0},{"$f":"SUM(H191:H193)","v":0}]
[" "," ",null,{"$f":"D71","v":"Total Credits Earned"},{"$f":"E187+E194","v":0},null,{"$f":"G187-G194","v":120}]
[]
["Spring",{"$f":"B74+3","v":2019},{"$f":"C2","v":"Last Name, First Name"}]
["Course",{"$f":"B19","v":"Req."},{"$f":"C19","v":"Req."},"Course Title","Credits","Grade","Degree Credits","SemesterYear"]
[null,null,null,null,null,null,null,{"$f":"$A$197&$B$197","v":"Spring2019"}]
[null,null,null,null,null,null,null,{"$f":"$A$197&$B$197","v":"Spring2019"}]
[null,null,null,null,null,null,null,"Spring2019"]
[null,null,null,null,null,null,null,"Spring2019"]
[null,null,null,null,null,null,null,"Spring2019"]
[null,null,null,null,null,null,null,"Spring2019"]
[null,null,null,null,null,null,null,"Spring2019"]
[null,null,null,null,null,null,null,"Spring2019"]
[null,null,null,null,null,null,null,"Spring2019"]
[null,null,null,null,null,null,null,"Spring2019"]
[" "," ",null,{"$f":"D86","v":"Semester Credits Earned"},{"$f":"SUM(E199:E208)","v":0},null,{"$f":"SUM(G199:G208)","v":0}]
[" "," ",null,{"$f":"D71","v":"Total Credits Earned"},{"$f":"E195+E209","v":0},null,{"$f":"G195-G209","v":120}]
[]
["Summer",{"$f":"B74+3","v":2019},{"$f":"C2","v":"Last Name, First Name"}]
["Course",{"$f":"B19","v":"Req."},{"$f":"C19","v":"Req."},"Course Title","Credits","Grade","Degree Credits","SemesterYear"]
[null,null,null,null,null,null,null,{"$f":"$A$212&$B$212","v":"Summer2019"}]
[null,null,null,null,null,null,null,{"$f":"$A$212&$B$212","v":"Summer2019"}]
[null,null,null,null,null,null,null,"Summer2019"]
[null,null,null,null,null,null,null,"Summer2019"]
[null,null,null,null,null,null,null,"Summer2019"]
[null,null,null,null,null,null,null,"Summer2019"]
[" "," ",null,{"$f":"D86","v":"Semester Credits Earned"},{"$f":"SUM(E214:E219)","v":0},null,{"$f":"SUM(G213:G219)","v":0}]
[" "," ",null,{"$f":"D71","v":"Total Credits Earned"},{"$f":"E210+E220","v":0},null,{"$f":"G210-G220","v":120}]
[]
["Year 4"]
["Fall",{"$f":"B74+3","v":2019},{"$f":"C2","v":"Last Name, First Name"}]
["Course",{"$f":"B19","v":"Req."},{"$f":"C19","v":"Req."},"Course Title","Credits","Grade","Degree Credits","SemesterYear"]
[null,null,null,null,null,null,null,{"$f":"$A$224&$B$224","v":"Fall2019"}]
[null,null,null,null,null,null,null,{"$f":"$A$224&$B$224","v":"Fall2019"}]
[null,null,null,null,null,null,null,"Fall2019"]
[null,null,null,null,null,null,null,"Fall2019"]
[null,null,null,null,null,null,null,"Fall2019"]
[null,null,null,null,null,null,null,"Fall2019"]
[null,null,null,null,null,null,null,"Fall2019"]
[null,null,null,null,null,null,null,"Fall2019"]
[null,null,null,null,null,null,null,"Fall2019"]
[null,null,null,null,null,null,null,"Fall2019"]
[" "," ",null,{"$f":"D86","v":"Semester Credits Earned"},{"$f":"SUM(E226:E235)","v":0},null,{"$f":"SUM(G226:G235)","v":0}]
[" "," ",null,{"$f":"D71","v":"Total Credits Earned"},{"$f":"E221+E236","v":0},null,{"$f":"G221-G236","v":120}]
[]
["Winter",{"$f":"B74+4","v":2020},{"$f":"C2","v":"Last Name, First Name"}]
["Course",{"$f":"B19","v":"Req."},{"$f":"C19","v":"Req."},"Course Title","Credits","Grade","Degree Credits","SemesterYear"]
[null,null,null,null,null,null,null,{"$f":"$A$239&$B$239","v":"Winter2020"}]
[null,null,null,null,null,null,null,{"$f":"$A$239&$B$239","v":"Winter2020"}]
[null,null,null,null,null,null,null,"Winter2020"]
[" "," ",null,{"$f":"D86","v":"Semester Credits Earned"},{"$f":"SUM(E241:E243)","v":0},null,{"$f":"SUM(G241:G243)","v":0}]
[" "," ",null,{"$f":"D71","v":"Total Credits Earned"},{"$f":"E237+E244","v":0},null,{"$f":"G237-G244","v":120}]
[]
["Spring",{"$f":"B74+4","v":2020},{"$f":"C2","v":"Last Name, First Name"}]
["Course",{"$f":"B19","v":"Req."},{"$f":"C19","v":"Req."},"Course Title","Credits","Grade","Degree Credits","SemesterYear"]
[null,null,null,null,null,null,null,{"$f":"$A$247&$B$247","v":"Spring2020"}]
[null,null,null,null,null,null,null,{"$f":"$A$247&$B$247","v":"Spring2020"}]
[null,null,null,null,null,null,null,"Spring2020"]
[null,null,null,null,null,null,null,"Spring2020"]
[null,null,null,null,null,null,null,"Spring2020"]
[null,null,null,null,null,null,null,"Spring2020"]
[null,null,null,null,null,null,null,"Spring2020"]
[null,null,null,null,null,null,null,"Spring2020"]
[null,null,null,null,null,null,null,"Spring2020"]
[null,null,null,null,null,null,null,"Spring2020"]
[" "," ",null,{"$f":"D86","v":"Semester Credits Earned"},{"$f":"SUM(E249:E258)","v":0},null,{"$f":"SUM(G249:G258)","v":0}]
[" "," ",null,{"$f":"D71","v":"Total Credits Earned"},{"$f":"E245+E259","v":0},null,{"$f":"G245-G259","v":120}]
[]
["Summer",{"$f":"B74+4","v":2020},{"$f":"C2","v":"Last Name, First Name"}]
["Course",{"$f":"B19","v":"Req."},{"$f":"C19","v":"Req."},"Course Title","Credits","Grade","Degree Credits","SemesterYear"]
[null,null,null,null,null,null,null,{"$f":"$A$262&$B$262","v":"Summer2020"}]
[null,null,null,null,null,null,null,{"$f":"$A$262&$B$262","v":"Summer2020"}]
[null,null,null,null,null,null,null,"Summer2020"]
[null,null,null,null,null,null,null,"Summer2020"]
[null,null,null,null,null,null,null,"Summer2020"]
[null,null,null,null,null,null,null,"Summer2020"]
[" "," ",null,{"$f":"D86","v":"Semester Credits Earned"},{"$f":"SUM(E264:E269)","v":0},null,{"$f":"SUM(G263:G269)","v":0}]
[" "," ",null,{"$f":"D71","v":"Total Credits Earned"},{"$f":"E260+E270","v":0},null,{"$f":"G260-G270","v":120}]
[]
["Year 5"]
["Fall",{"$f":"B74+4","v":2020},{"$f":"C2","v":"Last Name, First Name"}]
["Course",{"$f":"B19","v":"Req."},{"$f":"C19","v":"Req."},"Course Title","Credits","Grade","Degree Credits","SemesterYear"]
[null,null,null,null,null,null,null,{"$f":"$A$274&$B$274","v":"Fall2020"}]
[null,null,null,null,null,null,null,{"$f":"$A$274&$B$274","v":"Fall2020"}]
[null,null,null,null,null,null,null,"Fall2020"]
[null,null,null,null,null,null,null,"Fall2020"]
[null,null,null,null,null,null,null,"Fall2020"]
[null,null,null,null,null,null,null,"Fall2020"]
[null,null,null,null,null,null,null,"Fall2020"]
[null,null,null,null,null,null,null,"Fall2020"]
[null,null,null,null,null,null,null,"Fall2020"]
[null,null,null,null,null,null,null,"Fall2020"]
[" "," ",null,{"$f":"D86","v":"Semester Credits Earned"},{"$f":"SUM(E276:E285)","v":0},null,{"$f":"SUM(G276:G285)","v":0}]
[" "," ",null,{"$f":"D71","v":"Total Credits Earned"},{"$f":"E271+E286","v":0},null,{"$f":"G271-G286","v":120}]
[]
["Winter",{"$f":"B74+5","v":2021},{"$f":"C2","v":"Last Name, First Name"}]
["Course",{"$f":"B19","v":"Req."},{"$f":"C19","v":"Req."},"Course Title","Credits","Grade","Degree Credits","SemesterYear"]
[null,null,null,null,null,null,null,{"$f":"$A$289&$B$289","v":"Winter2021"}]
[null,null,null,null,null,null,null,{"$f":"$A$289&$B$289","v":"Winter2021"}]
[null,null,null,null,null,null,null,"Winter2021"]
[" "," ",null,{"$f":"D86","v":"Semester Credits Earned"},{"$f":"SUM(E291:E293)","v":0},null,{"$f":"SUM(G291:G293)","v":0}]
[" "," ",null,{"$f":"D71","v":"Total Credits Earned"},{"$f":"E287+E294","v":0},null,{"$f":"G287-G294","v":120}]
[]
["Spring",{"$f":"B74+5","v":2021},{"$f":"C2","v":"Last Name, First Name"}]
["Course",{"$f":"B19","v":"Req."},{"$f":"C19","v":"Req."},"Course Title","Credits","Grade","Degree Credits","SemesterYear"]
[null,null,null,null,null,null,null,{"$f":"$A$297&$B$297","v":"Spring2021"}]
[null,null,null,null,null,null,null,{"$f":"$A$297&$B$297","v":"Spring2021"}]
[null,null,null,null,null,null,null,"Spring2021"]
[null,null,null,null,null,null,null,"Spring2021"]
[null,null,null,null,null,null,null,"Spring2021"]
[null,null,null,null,null,null,null,"Spring2021"]
[null,null,null,null,null,null,null,"Spring2021"]
[null,null,null,null,null,null,null,"Spring2021"]
[null,null,null,null,null,null,null,"Spring2021"]
[null,null,null,null,null,null,null,"Spring2021"]
[" "," ",null,{"$f":"D86","v":"Semester Credits Earned"},{"$f":"SUM(E299:E308)","v":0},null,{"$f":"SUM(G299:G308)","v":0}]
[" "," ",null,{"$f":"D71","v":"Total Credits Earned"},{"$f":"E295+E309","v":0},null,{"$f":"G295-G309","v":120}]
[]
["Summer",{"$f":"B74+5","v":2021},{"$f":"C2","v":"Last Name, First Name"}]
["Course",{"$f":"B19","v":"Req."},{"$f":"C19","v":"Req."},"Course Title","Credits","Grade","Degree Credits","SemesterYear"]
[null,null,null,null,null,null,null,{"$f":"$A$312&$B$312","v":"Summer2021"}]
[null,null,null,null,null,null,null,{"$f":"$A$312&$B$312","v":"Summer2021"}]
[null,null,null,null,null,null,null,"Summer2021"]
[null,null,null,null,null,null,null,"Summer2021"]
[null,null,null,null,null,null,null,"Summer2021"]
[null,null,null,null,null,null,null,"Summer2021"]
[" "," ",null,{"$f":"D86","v":"Semester Credits Earned"},{"$f":"SUM(E314:E319)","v":0},null,{"$f":"SUM(G313:G319)","v":0}]
[" "," ",null,{"$f":"D71","v":"Total Credits Earned"},{"$f":"E310+E320","v":0},null,{"$f":"G310-G320","v":120}]
[]
["Year 6"]
["Fall",{"$f":"B74+5","v":2021},{"$f":"C2","v":"Last Name, First Name"}]
["Course",{"$f":"B19","v":"Req."},{"$f":"C19","v":"Req."},"Course Title","Credits","Grade","Degree Credits","SemesterYear"]
[null,null,null,null,null,null,null,{"$f":"$A$324&$B$324","v":"Fall2021"}]
[null,null,null,null,null,null,null,{"$f":"$A$324&$B$324","v":"Fall2021"}]
[null,null,null,null,null,null,null,"Fall2021"]
[null,null,null,null,null,null,null,"Fall2021"]
[null,null,null,null,null,null,null,"Fall2021"]
[null,null,null,null,null,null,null,"Fall2021"]
[null,null,null,null,null,null,null,"Fall2021"]
[null,null,null,null,null,null,null,"Fall2021"]
[null,null,null,null,null,null,null,"Fall2021"]
[null,null,null,null,null,null,null,"Fall2021"]
[" "," ",null,{"$f":"D136","v":"Semester Credits Earned"},{"$f":"SUM(E326:E335)","v":0},null,{"$f":"SUM(G326:G335)","v":0}]
[" "," ",null,{"$f":"D121","v":"Total Credits Earned"},{"$f":"E321+E336","v":0},null,{"$f":"G321-G336","v":120}]
[]
["Winter",{"$f":"B74+6","v":2022},{"$f":"C2","v":"Last Name, First Name"}]
["Course",{"$f":"B19","v":"Req."},{"$f":"C19","v":"Req."},"Course Title","Credits","Grade","Degree Credits","SemesterYear"]
[null,null,null,null,null,null,null,{"$f":"$A$339&$B$339","v":"Winter2022"}]
[null,null,null,null,null,null,null,{"$f":"$A$339&$B$339","v":"Winter2022"}]
[null,null,null,null,null,null,null,"Winter2022"]
[" "," ",null,{"$f":"D136","v":"Semester Credits Earned"},{"$f":"SUM(E341:E343)","v":0},null,{"$f":"SUM(G341:G343)","v":0}]
[" "," ",null,{"$f":"D121","v":"Total Credits Earned"},{"$f":"E337+E344","v":0},null,{"$f":"G337-G344","v":120}]
[]
["Spring",{"$f":"B74+6","v":2022},{"$f":"C2","v":"Last Name, First Name"}]
["Course",{"$f":"B19","v":"Req."},{"$f":"C19","v":"Req."},"Course Title","Credits","Grade","Degree Credits","SemesterYear"]
[null,null,null,null,null,null,null,{"$f":"$A$347&$B$347","v":"Spring2022"}]
[null,null,null,null,null,null,null,{"$f":"$A$347&$B$347","v":"Spring2022"}]
[null,null,null,null,null,null,null,"Spring2022"]
[null,null,null,null,null,null,null,"Spring2022"]
[null,null,null,null,null,null,null,"Spring2022"]
[null,null,null,null,null,null,null,"Spring2022"]
[null,null,null,null,null,null,null,"Spring2022"]
[null,null,null,null,null,null,null,"Spring2022"]
[null,null,null,null,null,null,null,"Spring2022"]
[null,null,null,null,null,null,null,"Spring2022"]
[" "," ",null,{"$f":"D136","v":"Semester Credits Earned"},{"$f":"SUM(E349:E358)","v":0},null,{"$f":"SUM(G349:G358)","v":0}]
[" "," ",null,{"$f":"D121","v":"Total Credits Earned"},{"$f":"E345+E359","v":0},null,{"$f":"G345-G359","v":120}]
[]
["Summer",{"$f":"B74+6","v":2022},{"$f":"C2","v":"Last Name, First Name"}]
["Course",{"$f":"B19","v":"Req."},{"$f":"C19","v":"Req."},"Course Title","Credits","Grade","Degree Credits","SemesterYear"]
[null,null,null,null,null,null,null,{"$f":"$A$362&$B$362","v":"Summer2022"}]
[null,null,null,null,null,null,null,{"$f":"$A$362&$B$362","v":"Summer2022"}]
[null,null,null,null,null,null,null,"Summer2022"]
[null,null,null,null,null,null,null,"Summer2022"]
[null,null,null,null,null,null,null,"Summer2022"]
[null,null,null,null,null,null,null,"Summer2022"]
[" "," ",null,{"$f":"D136","v":"Semester Credits Earned"},{"$f":"SUM(E364:E369)","v":0},null,{"$f":"SUM(G363:G369)","v":0}]
[" "," ",null,{"$f":"D121","v":"Total Credits Earned"},{"$f":"E360+E370","v":0},null,{"$f":"G360-G370","v":120}]
[]
[]
[null,"Graduation Plan Review & Approval"]
[]
[]
[]
[null,"Initial Review: OASiS",null,null,"Date"]
[]
[]
[]
[null,"Additional Review: Faculty Mentor",null,null,"Date"]
[]
[null," ",null,null," "]
[]
[null,"Secondary Major Review",null,null,"Date"]
[]
[null," ",null,null," "]
[]
[null,"Final Review: OASiS Approval",null,null,"Date"]
[]
[null," ",null,null," "]
[]
[null,{"$f":"C2","v":"Last Name, First Name"},null,null,"Date"]
[]
[]
[]
[]
[null,"OASiS Comments"]

{"sheet":"Checklist","index":8,"n_rows":113,"n_cols":13,"rows_kept":113,"cut":false,"hidden":true,"merged":[[26,0,26,8],[0,0,0,8],[0,11,0,12],[1,0,1,2],[1,4,1,6],[1,11,1,12],[2,0,2,8],[17,0,17,8],[20,0,20,8],[24,0,24,8],[25,0,25,2],[25,4,25,6],[62,0,62,8],[62,11,62,12],[28,0,28,8],[35,0,35,8],[35,11,35,12],[36,0,36,2],[36,4,36,6],[36,11,36,12],[50,0,50,8],[50,11,50,12],[51,0,51,2],[51,4,51,6],[51,11,51,12],[83,0,83,2],[83,4,83,6],[83,11,83,12],[63,0,63,2],[63,4,63,6],[63,11,63,12],[64,11,64,12],[74,0,74,8],[75,0,75,2],[75,4,75,6],[78,0,78,8],[79,0,79,2],[79,4,79,6],[82,0,82,8],[82,11,82,12],[105,0,105,8],[106,0,106,8],[108,0,108,8],[84,0,84,8],[87,0,87,8],[89,0,89,8],[93,0,93,8],[97,0,97,8],[102,0,102,8]]}
["Checklist - Computer Science",null,null,null,null,null,null,null,null,null,"Graduation_Plan","Required Computer Science Electives"]
["Requirement",null,null,"Credits","Taken",null,null,"Semester","Credits",null,null,"List courses you are interested in possibly taking. (NOTE: This is not required.)"]
["Required Computer Science Courses",null,null,null,null,null,null,null,null,null,null,"Course","Title"]
["COMP.1010","or","91.101",3,"COMP.1010","or","91.101",{"$f":"IF(AND(ISNA(VLOOKUP(E4,INDIRECT(\"'\"&$K$1&\"'!$A$1:$H$550\"),8,FALSE)), ISNA(VLOOKUP(G4,INDIRECT(\"'\"&$K$1&\"'!$A$1:$H$550\"),8,FALSE))), \"Not Found\", (IF(ISNA(VLOOKUP(E4,INDIRECT(\"'\"&$K$1&\"'!$A$1:$H$550\"),8,FALSE)), VLOOKUP(G4,INDIRECT(\"'\"&$K$1&\"'!$A$1:$H$550\"),8,FALSE), VLOOKUP(E4,INDIRECT(\"'\"&$K$1&\"'!$A$1:$H$550\"),8,FALSE))))","v":"Not Found"},{"$f":"IF(AND(ISNA(VLOOKUP(E4,INDIRECT(\"'\"&$K$1&\"'!$A$1:$H$550\"),5,FALSE)), ISNA(VLOOKUP(G4,INDIRECT(\"'\"&$K$1&\"'!$A$1:$H$550\"),5,FALSE))), \"0\", (IF(ISNA(VLOOKUP(E4,INDIRECT(\"'\"&$K$1&\"'!$A$1:$H$550\"),5,FALSE)), VLOOKUP(G4,INDIRECT(\"'\"&$K$1&\"'!$A$1:$H$550\"),5,FALSE), VLOOKUP(E4,INDIRECT(\"'\"&$K$1&\"'!$A$1:$H$550\"),5,FALSE))))","v":"0"}]
["COMP.1030L","or","91.103",1,"COMP.1030L","or","91.103",{"$f":"IF(AND(ISNA(VLOOKUP(E5,INDIRECT(\"'\"&$K$1&\"'!$A$1:$H$550\"),8,FALSE)), ISNA(VLOOKUP(G5,INDIRECT(\"'\"&$K$1&\"'!$A$1:$H$550\"),8,FALSE))), \"Not Found\", (IF(ISNA(VLOOKUP(E5,INDIRECT(\"'\"&$K$1&\"'!$A$1:$H$550\"),8,FALSE)), VLOOKUP(G5,INDIRECT(\"'\"&$K$1&\"'!$A$1:$H$550\"),8,FALSE), VLOOKUP(E5,INDIRECT(\"'\"&$K$1&\"'!$A$1:$H$550\"),8,FALSE))))","v":"Not Found"},"0"]
["COMP.1020","or","91.102",3,"COMP.1020","or","91.102","Not Found",{"$f":"IF(AND(ISNA(VLOOKUP(E6,INDIRECT(\"'\"&$K$1&\"'!$A$1:$H$550\"),5,FALSE)), ISNA(VLOOKUP(G6,INDIRECT(\"'\"&$K$1&\"'!$A$1:$H$550\"),5,FALSE))), \"0\", (IF(ISNA(VLOOKUP(E6,INDIRECT(\"'\"&$K$1&\"'!$A$1:$H$550\"),5,FALSE)), VLOOKUP(G6,INDIRECT(\"'\"&$K$1&\"'!$A$1:$H$550\"),5,FALSE), VLOOKUP(E6,INDIRECT(\"'\"&$K$1&\"'!$A$1:$H$550\"),5,FALSE))))","v":"0"}]
["COMP.1040L","or","91.104",1,"COMP.1040L","or","91.104","Not Found",{"$f":"IF(AND(ISNA(VLOOKUP(E7,INDIRECT(\"'\"&$K$1&\"'!$A$1:$H$550\"),5,FALSE)), ISNA(VLOOKUP(G7,INDIRECT(\"'\"&$K$1&\"'!$A$1:$H$550\"),5,FALSE))), \"0\", (IF(ISNA(VLOOKUP(E7,INDIRECT(\"'\"&$K$1&\"'!$A$1:$H$550\"),5,FALSE)), VLOOKUP(G7,INDIRECT(\"'\"&$K$1&\"'!$A$1:$H$550\"),5,FALSE), VLOOKUP(E7,INDIRECT(\"'\"&$K$1&\"'!$A$1:$H$550\"),5,FALSE))))","v":"0"}]
["COMP.2010","or","91.201",3,"COMP.2010","or","91.201","Not Found","0"]
["COMP.2010L",null,null,1,"COMP.2010L",null,null,{"$f":"IF(AND(ISNA(VLOOKUP(E9,INDIRECT(\"'\"&$K$1&\"'!$A$1:$H$550\"),8,FALSE)), ISNA(VLOOKUP(G9,INDIRECT(\"'\"&$K$1&\"'!$A$1:$H$550\"),8,FALSE))), \"Not Found\", (IF(ISNA(VLOOKUP(E9,INDIRECT(\"'\"&$K$1&\"'!$A$1:$H$550\"),8,FALSE)), VLOOKUP(G9,INDIRECT(\"'\"&$K$1&\"'!$A$1:$H$550\"),8,FALSE), VLOOKUP(E9,INDIRECT(\"'\"&$K$1&\"'!$A$1:$H$550\"),8,FALSE))))","v":"Not Found"},{"$f":"IF(AND(ISNA(VLOOKUP(E9,INDIRECT(\"'\"&$K$1&\"'!$A$1:$H$550\"),5,FALSE)), ISNA(VLOOKUP(G9,INDIRECT(\"'\"&$K$1&\"'!$A$1:$H$550\"),5,FALSE))), \"0\", (IF(ISNA(VLOOKUP(E9,INDIRECT(\"'\"&$K$1&\"'!$A$1:$H$550\"),5,FALSE)), VLOOKUP(G9,INDIRECT(\"'\"&$K$1&\"'!$A$1:$H$550\"),5,FALSE), VLOOKUP(E9,INDIRECT(\"'\"&$K$1&\"'!$A$1:$H$550\"),5,FALSE))))","v":"0"}]
["COMP.2030","or","91.203",3,"COMP.2030","or","91.203","Not Found","0"]
["COMP.2030L",null,null,1,"COMP.2030L",null,null,{"$f":"IF(AND(ISNA(VLOOKUP(E11,INDIRECT(\"'\"&$K$1&\"'!$A$1:$H$550\"),8,FALSE)), ISNA(VLOOKUP(G11,INDIRECT(\"'\"&$K$1&\"'!$A$1:$H$550\"),8,FALSE))), \"Not Found\", (IF(ISNA(VLOOKUP(E11,INDIRECT(\"'\"&$K$1&\"'!$A$1:$H$550\"),8,FALSE)), VLOOKUP(G11,INDIRECT(\"'\"&$K$1&\"'!$A$1:$H$550\"),8,FALSE), VLOOKUP(E11,INDIRECT(\"'\"&$K$1&\"'!$A$1:$H$550\"),8,FALSE))))","v":"Not Found"},{"$f":"IF(AND(ISNA(VLOOKUP(E11,INDIRECT(\"'\"&$K$1&\"'!$A$1:$H$550\"),5,FALSE)), ISNA(VLOOKUP(G11,INDIRECT(\"'\"&$K$1&\"'!$A$1:$H$550\"),5,FALSE))), \"0\", (IF(ISNA(VLOOKUP(E11,INDIRECT(\"'\"&$K$1&\"'!$A$1:$H$550\"),5,FALSE)), VLOOKUP(G11,INDIRECT(\"'\"&$K$1&\"'!$A$1:$H$550\"),5,FALSE), VLOOKUP(E11,INDIRECT(\"'\"&$K$1&\"'!$A$1:$H$550\"),5,FALSE))))","v":"0"}]
["COMP.2040","or","91.204",3,"COMP.2040","or","91.204","Not Found","0"]
["COMP.3010","or","91.301",3,"COMP.3010","or","91.301","Not Found","0"]
["COMP.3040","or","91.304",3,"COMP.3040","or","91.304","Not Found","0"]
["COMP.3050","or","91.305",3,"COMP.3050","or","91.305","Not Found","0"]
["COMP.3080","or","91.308",3,"COMP.3080","or","91.308","Not Found","0"]
["COMP.4040","or","91.404",3,"COMP.4040","or","91.404","Not Found","0"]
["Required CS Electives"]
["CSE-1",null,null,3,{"$f":"IF(ISNA(INDEX(INDIRECT(\"'\"&$K$1&\"'!$A$1:$A$550\"), MATCH(A19,INDIRECT(\"'\"&$K$1&\"'!$B$1:$B$550\"),0))), \"Not Found\", (INDEX(INDIRECT(\"'\"&$K$1&\"'!$A$1:$A$550\"), MATCH(A19,INDIRECT(\"'\"&$K$1&\"'!$B$1:$B$550\"),0))))","v":"Not Found"},null,null,{"$f":"IF(ISNA(VLOOKUP(E19,INDIRECT(\"'\"&$K$1&\"'!$A$1:$H$550\"),8,FALSE)), \"Not Found\", VLOOKUP(E19,INDIRECT(\"'\"&$K$1&\"'!$A$1:$H$550\"),8,FALSE))","v":"Not Found"},{"$f":"IF(ISNA(VLOOKUP(E19,INDIRECT(\"'\"&$K$1&\"'!$A$1:$H$550\"),5,FALSE)), \"0\", VLOOKUP(E19,INDIRECT(\"'\"&$K$1&\"'!$A$1:$H$550\"),5,FALSE))","v":"0"}]
["CSE-2",null,null,3,"Not Found",null,null,"Not Found","0"]
["CS Project Course"]
["Sr.Prj-1",null,null,3,"Not Found",null,null,"Not Found","0"]
["Sr.Prj-2",null,null,3,"Not Found",null,null,"Not Found","0"]
[]
["Required Supporting Technical Course"]
["Requirement",null,null,"Credits","Taken",null,null,"Semester","Credits"]
["Electrical Engineering"]
["EECE.2650","or","16.265",3,"EECE.2650","or","16.265",{"$f":"IF(AND(ISNA(VLOOKUP(E28,INDIRECT(\"'\"&$K$1&\"'!$A$1:$H$550\"),8,FALSE)), ISNA(VLOOKUP(G28,INDIRECT(\"'\"&$K$1&\"'!$A$1:$H$550\"),8,FALSE))), \"Not Found\", (IF(ISNA(VLOOKUP(E28,INDIRECT(\"'\"&$K$1&\"'!$A$1:$H$550\"),8,FALSE)), VLOOKUP(G28,INDIRECT(\"'\"&$K$1&\"'!$A$1:$H$550\"),8,FALSE), VLOOKUP(E28,INDIRECT(\"'\"&$K$1&\"'!$A$1:$H$550\"),8,FALSE))))","v":"Not Found"},{"$f":"IF(AND(ISNA(VLOOKUP(E28,INDIRECT(\"'\"&$K$1&\"'!$A$1:$H$550\"),5,FALSE)), ISNA(VLOOKUP(G28,INDIRECT(\"'\"&$K$1&\"'!$A$1:$H$550\"),5,FALSE))), \"0\", (IF(ISNA(VLOOKUP(E28,INDIRECT(\"'\"&$K$1&\"'!$A$1:$H$550\"),5,FALSE)), VLOOKUP(G28,INDIRECT(\"'\"&$K$1&\"'!$A$1:$H$550\"),5,FALSE), VLOOKUP(E28,INDIRECT(\"'\"&$K$1&\"'!$A$1:$H$550\"),5,FALSE))))","v":"0"}]
["Mathematics"]
["MATH.1310","or","92.131",4,"MATH.1310","or","92.131",{"$f":"IF(AND(ISNA(VLOOKUP(E30,INDIRECT(\"'\"&$K$1&\"'!$A$1:$H$550\"),8,FALSE)), ISNA(VLOOKUP(G30,INDIRECT(\"'\"&$K$1&\"'!$A$1:$H$550\"),8,FALSE))), \"Not Found\", (IF(ISNA(VLOOKUP(E30,INDIRECT(\"'\"&$K$1&\"'!$A$1:$H$550\"),8,FALSE)), VLOOKUP(G30,INDIRECT(\"'\"&$K$1&\"'!$A$1:$H$550\"),8,FALSE), VLOOKUP(E30,INDIRECT(\"'\"&$K$1&\"'!$A$1:$H$550\"),8,FALSE))))","v":"Not Found"},{"$f":"IF(AND(ISNA(VLOOKUP(E30,INDIRECT(\"'\"&$K$1&\"'!$A$1:$H$550\"),5,FALSE)), ISNA(VLOOKUP(G30,INDIRECT(\"'\"&$K$1&\"'!$A$1:$H$550\"),5,FALSE))), \"0\", (IF(ISNA(VLOOKUP(E30,INDIRECT(\"'\"&$K$1&\"'!$A$1:$H$550\"),5,FALSE)), VLOOKUP(G30,INDIRECT(\"'\"&$K$1&\"'!$A$1:$H$550\"),5,FALSE), VLOOKUP(E30,INDIRECT(\"'\"&$K$1&\"'!$A$1:$H$550\"),5,FALSE))))","v":"0"}]
["MATH.1320","or","92.132",4,"MATH.1320","or","92.132","Not Found","0"]
["MATH.3210","or","92.321",3,"MATH.3210","or","92.321","Not Found","0"]
["MATH.3220","or","92.322",3,"MATH.3220","or","92.322","Not Found","0"]
["MATH.3860","or","92.386",3,"MATH.3860","or","92.386","Not Found","0"]
[]
["Natural Science Electives",null,null,null,null,null,null,null,null,null,null,"Natural Science Electives"]
["Requirement",null,null,"Credits","Taken",null,null,"Semester","Credits",null,null,"List courses you are interested in possibly taking to satisfy this requirement"]
["NS-1",null,null,3,{"$f":"IF(ISNA(INDEX(INDIRECT(\"'\"&$K$1&\"'!$A$1:$A$550\"), MATCH(A38,INDIRECT(\"'\"&$K$1&\"'!$C$1:$C$550\"),0))), \"Not Found\", (INDEX(INDIRECT(\"'\"&$K$1&\"'!$A$1:$A$550\"), MATCH(A38,INDIRECT(\"'\"&$K$1&\"'!$C$1:$C$550\"),0))))","v":"Not Found"},null,null,{"$f":"IF(ISNA(VLOOKUP(E38,INDIRECT(\"'\"&$K$1&\"'!$A$1:$H$550\"),8,FALSE)), \"Not Found\", VLOOKUP(E38,INDIRECT(\"'\"&$K$1&\"'!$A$1:$H$550\"),8,FALSE))","v":"Not Found"},{"$f":"IF(ISNA(VLOOKUP(E38,INDIRECT(\"'\"&$K$1&\"'!$A$1:$H$550\"),5,FALSE)), \"0\", VLOOKUP(E38,INDIRECT(\"'\"&$K$1&\"'!$A$1:$H$550\"),5,FALSE))","v":"0"},null,null,"Course","Title"]
["NS-Lab1",null,null,1,{"$f":"IF(ISNA(INDEX(INDIRECT(\"'\"&$K$1&\"'!$A$1:$A$550\"), MATCH(A39,INDIRECT(\"'\"&$K$1&\"'!$C$1:$C$550\"),0))), \"Not Found\", (INDEX(INDIRECT(\"'\"&$K$1&\"'!$A$1:$A$550\"), MATCH(A39,INDIRECT(\"'\"&$K$1&\"'!$C$1:$C$550\"),0))))","v":"Not Found"},null,null,"Not Found","0"]
["NS-2",null,null,3,"Not Found",null,null,"Not Found","0"]
["NS-Lab2",null,null,1,"Not Found",null,null,"Not Found","0"]
["NS-3",null,null,3,"Not Found",null,null,"Not Found","0"]
["NS-Lab3",null,null,1,"Not Found",null,null,"Not Found","0"]
["Not Req.",null,null,"n/a","Not Found",null,null,"Not Found","0"]
["Not Req.",null,null,"n/a","Not Found",null,null,"Not Found","0"]
[]
[]
[]
[]
[]
["Technical Electives",null,null,null,null,null,null,null,null,null,null,"Technical Electives"]
["Requirement",null,null,"Credits","Taken",null,null,"Semester","Credits",null,null,"List courses you are interested in possibly taking to satisfy this requirement"]
["TE-1",null,null,3,{"$f":"IF(ISNA(INDEX(INDIRECT(\"'\"&$K$1&\"'!$A$1:$A$550\"), MATCH(A53,INDIRECT(\"'\"&$K$1&\"'!$B$1:$B$550\"),0))), \"Not Found\", (INDEX(INDIRECT(\"'\"&$K$1&\"'!$A$1:$A$550\"), MATCH(A53,INDIRECT(\"'\"&$K$1&\"'!$B$1:$B$550\"),0))))","v":"Not Found"},null,null,{"$f":"IF(ISNA(VLOOKUP(E53,INDIRECT(\"'\"&$K$1&\"'!$A$1:$H$550\"),8,FALSE)), \"Not Found\", VLOOKUP(E53,INDIRECT(\"'\"&$K$1&\"'!$A$1:$H$550\"),8,FALSE))","v":"Not Found"},{"$f":"IF(ISNA(VLOOKUP(E53,INDIRECT(\"'\"&$K$1&\"'!$A$1:$H$550\"),5,FALSE)), \"0\", VLOOKUP(E53,INDIRECT(\"'\"&$K$1&\"'!$A$1:$H$550\"),5,FALSE))","v":"0"},null,null,"Course","Title"]
["TE-2",null,null,3,"Not Found",null,null,"Not Found","0"]
["Not Req.",null,null,"n/a","Not Found",null,null,"Not Found","0"]
["Not Req.",null,null,"n/a","Not Found",null,null,"Not Found","0"]
["Not Req.",null,null,"n/a","Not Found",null,null,"Not Found","0"]
[]
[]
[]
[]
[]
["Free Electives (FE)",null,null,null,null,null,null,null,null,null,null,"Free Electives"]
["Requirement",null,null,"Credits","Taken",null,null,"Semester","Credits",null,null,"List free electives you are interested in taking.  These cannot be below the level of a"]
["FE-1",null,null,3,{"$f":"IF(ISNA(INDEX(INDIRECT(\"'\"&$K$1&\"'!$A$1:$A$550\"), MATCH(\"*\"&A65&\"*\",INDIRECT(\"'\"&$K$1&\"'!$B$1:$B$550\"),0))), \"Not Found\", (INDEX(INDIRECT(\"'\"&$K$1&\"'!$A$1:$A$550\"), MATCH(\"*\"&A65&\"*\",INDIRECT(\"'\"&$K$1&\"'!$B$1:$B$550\"),0))))","v":"Not Found"},null,null,{"$f":"IF(ISNA(VLOOKUP(E65,INDIRECT(\"'\"&$K$1&\"'!$A$1:$H$550\"),8,FALSE)), \"Not Found\", VLOOKUP(E65,INDIRECT(\"'\"&$K$1&\"'!$A$1:$H$550\"),8,FALSE))","v":"Not Found"},{"$f":"IF(ISNA(VLOOKUP(E65,INDIRECT(\"'\"&$K$1&\"'!$A$1:$H$550\"),5,FALSE)), \"0\", VLOOKUP(E65,INDIRECT(\"'\"&$K$1&\"'!$A$1:$H$550\"),5,FALSE))","v":"0"},null,null,"required course.  Specific courses may be recommended for different CS tracks."]
["FE-2",null,null,3,"Not Found",null,null,"Not Found","0"]
["FE-3",null,null,3,"Not Found",null,null,"Not Found","0"]
["FE-4",null,null,3,"Not Found",null,null,"Not Found","0"]
["Not Req.",null,null,"n/a","Not Found",null,null,"Not Found","0"]
["Not Req.",null,null,"n/a","Not Found",null,null,"Not Found","0"]
[]
["Required FE Credits",null,null,null,null,null,null,"Projected Credits"]
[null,null,null,{"$f":"120-SUM(D4:D45, D53:D57, D86:D87,D91:D97)","v":12},null,null,null,null,{"$f":"SUM(I65:I71)","v":0}]
[]
["Oral & Written Communication"]
["Requirement",null,null,"Credits","Taken",null,null,"Semester","Credits"]
["ENGL.2200","or","42.220",3,"ENGL.2200","or","42.220",{"$f":"IF(AND(ISNA(VLOOKUP(E77,INDIRECT(\"'\"&$K$1&\"'!$A$1:$H$550\"),8,FALSE)), ISNA(VLOOKUP(G77,INDIRECT(\"'\"&$K$1&\"'!$A$1:$H$550\"),8,FALSE))), \"Not Found\", (IF(ISNA(VLOOKUP(E77,INDIRECT(\"'\"&$K$1&\"'!$A$1:$H$550\"),8,FALSE)), VLOOKUP(G77,INDIRECT(\"'\"&$K$1&\"'!$A$1:$H$550\"),8,FALSE), VLOOKUP(E77,INDIRECT(\"'\"&$K$1&\"'!$A$1:$H$550\"),8,FALSE))))","v":"Not Found"},{"$f":"IF(AND(ISNA(VLOOKUP(E77,INDIRECT(\"'\"&$K$1&\"'!$A$1:$H$550\"),5,FALSE)), ISNA(VLOOKUP(G77,INDIRECT(\"'\"&$K$1&\"'!$A$1:$H$550\"),5,FALSE))), \"0\", (IF(ISNA(VLOOKUP(E77,INDIRECT(\"'\"&$K$1&\"'!$A$1:$H$550\"),5,FALSE)), VLOOKUP(G77,INDIRECT(\"'\"&$K$1&\"'!$A$1:$H$550\"),5,FALSE), VLOOKUP(E77,INDIRECT(\"'\"&$K$1&\"'!$A$1:$H$550\"),5,FALSE))))","v":"0"}]
[]
["CS Ethics Requirement"]
["Requirement",null,null,"Credits","Taken",null,null,"Semester","Credits"]
["CSET",null,null,3,{"$f":"IF(ISNA(INDEX(INDIRECT(\"'\"&$K$1&\"'!$A$1:$A$550\"), MATCH(A81,INDIRECT(\"'\"&$K$1&\"'!$C$1:$C$550\"),0))), \"Not Found\", (INDEX(INDIRECT(\"'\"&$K$1&\"'!$A$1:$A$550\"), MATCH(A81,INDIRECT(\"'\"&$K$1&\"'!$C$1:$C$550\"),0))))","v":"Not Found"},null,null,{"$f":"IF(ISNA(VLOOKUP(E81,INDIRECT(\"'\"&$K$1&\"'!$A$1:$H$550\"),8,FALSE)), \"Not Found\", VLOOKUP(E81,INDIRECT(\"'\"&$K$1&\"'!$A$1:$H$550\"),8,FALSE))","v":"Not Found"},{"$f":"IF(ISNA(VLOOKUP(E81,INDIRECT(\"'\"&$K$1&\"'!$A$1:$H$550\"),5,FALSE)), \"0\", VLOOKUP(E81,INDIRECT(\"'\"&$K$1&\"'!$A$1:$H$550\"),5,FALSE))","v":"0"}]
[]
["Breadth of Knowledge",null,null,null,null,null,null,null,null,null,null," Breadth of Knowledge Requirements"]
["Requirement",null,null,"Credits","Taken",null,null,"Semester","Credits",null,null,"Select courses you are interested in taking to satisfy this Requirements."]
["College Writing",null,null,null,null,null,null,null,null,null,null,"Area","Title"]
["CW-1",null,null,3,{"$f":"IF(ISNA(INDEX(INDIRECT(\"'\"&$K$1&\"'!$A$1:$A$550\"), MATCH(A86,INDIRECT(\"'\"&$K$1&\"'!$B$1:$B$550\"),0))), \"Not Found\", (INDEX(INDIRECT(\"'\"&$K$1&\"'!$A$1:$A$550\"), MATCH(A86,INDIRECT(\"'\"&$K$1&\"'!$B$1:$B$550\"),0))))","v":"Not Found"},null,null,{"$f":"IF(ISNA(VLOOKUP(E86,INDIRECT(\"'\"&$K$1&\"'!$A$1:$H$550\"),8,FALSE)), \"Not Found\", VLOOKUP(E86,INDIRECT(\"'\"&$K$1&\"'!$A$1:$H$550\"),8,FALSE))","v":"Not Found"},{"$f":"IF(ISNA(VLOOKUP(E86,INDIRECT(\"'\"&$K$1&\"'!$A$1:$H$550\"),5,FALSE)), \"0\", VLOOKUP(E86,INDIRECT(\"'\"&$K$1&\"'!$A$1:$H$550\"),5,FALSE))","v":"0"}]
["CW-2",null,null,3,"Not Found",null,null,"Not Found","0"]
["Mathematics"]
["MA",null,null,4,{"$f":"IF(ISNA(INDEX(INDIRECT(\"'\"&$K$1&\"'!$A$1:$A$550\"), MATCH(A89,INDIRECT(\"'\"&$K$1&\"'!$B$1:$B$550\"),0))), \"Not Found\", (INDEX(INDIRECT(\"'\"&$K$1&\"'!$A$1:$A$550\"), MATCH(A89,INDIRECT(\"'\"&$K$1&\"'!$B$1:$B$550\"),0))))","v":"Not Found"},null,null,{"$f":"IF(ISNA(VLOOKUP(E89,INDIRECT(\"'\"&$K$1&\"'!$A$1:$H$550\"),8,FALSE)), \"Not Found\", VLOOKUP(E89,INDIRECT(\"'\"&$K$1&\"'!$A$1:$H$550\"),8,FALSE))","v":"Not Found"},{"$f":"IF(ISNA(VLOOKUP(E89,INDIRECT(\"'\"&$K$1&\"'!$A$1:$H$550\"),5,FALSE)), \"0\", VLOOKUP(E89,INDIRECT(\"'\"&$K$1&\"'!$A$1:$H$550\"),5,FALSE))","v":"0"}]
["Arts & Humanities"]
["AH-1",null,null,3,{"$f":"IF(ISNA(INDEX(INDIRECT(\"'\"&$K$1&\"'!$A$1:$A$550\"), MATCH(\"*\"&A91&\"*\",INDIRECT(\"'\"&$K$1&\"'!$B$1:$B$550\"),0))), \"Not Found\", (INDEX(INDIRECT(\"'\"&$K$1&\"'!$A$1:$A$550\"), MATCH(\"*\"&A91&\"*\",INDIRECT(\"'\"&$K$1&\"'!$B$1:$B$550\"),0))))","v":"Not Found"},null,null,{"$f":"IF(ISNA(VLOOKUP(E91,INDIRECT(\"'\"&$K$1&\"'!$A$1:$H$550\"),8,FALSE)), \"Not Found\", VLOOKUP(E91,INDIRECT(\"'\"&$K$1&\"'!$A$1:$H$550\"),8,FALSE))","v":"Not Found"},{"$f":"IF(ISNA(VLOOKUP(E91,INDIRECT(\"'\"&$K$1&\"'!$A$1:$H$550\"),5,FALSE)), \"0\", VLOOKUP(E91,INDIRECT(\"'\"&$K$1&\"'!$A$1:$H$550\"),5,FALSE))","v":"0"}]
["AH-2",null,null,3,{"$f":"IF(ISNA(INDEX(INDIRECT(\"'\"&$K$1&\"'!$A$1:$A$550\"), MATCH(\"*\"&A92&\"*\",INDIRECT(\"'\"&$K$1&\"'!$B$1:$B$550\"),0))), \"Not Found\", (INDEX(INDIRECT(\"'\"&$K$1&\"'!$A$1:$A$550\"), MATCH(\"*\"&A92&\"*\",INDIRECT(\"'\"&$K$1&\"'!$B$1:$B$550\"),0))))","v":"Not Found"},null,null,"Not Found","0"]
["AH-3",null,null,3,"Not Found",null,null,"Not Found","0"]
["Social Sciences"]
["SS-1",null,null,3,{"$f":"IF(ISNA(INDEX(INDIRECT(\"'\"&$K$1&\"'!$A$1:$A$550\"), MATCH(\"*\"&A95&\"*\",INDIRECT(\"'\"&$K$1&\"'!$B$1:$B$550\"),0))), \"Not Found\", (INDEX(INDIRECT(\"'\"&$K$1&\"'!$A$1:$A$550\"), MATCH(\"*\"&A95&\"*\",INDIRECT(\"'\"&$K$1&\"'!$B$1:$B$550\"),0))))","v":"Not Found"},null,null,{"$f":"IF(ISNA(VLOOKUP(E95,INDIRECT(\"'\"&$K$1&\"'!$A$1:$H$550\"),8,FALSE)), \"Not Found\", VLOOKUP(E95,INDIRECT(\"'\"&$K$1&\"'!$A$1:$H$550\"),8,FALSE))","v":"Not Found"},{"$f":"IF(ISNA(VLOOKUP(E95,INDIRECT(\"'\"&$K$1&\"'!$A$1:$H$550\"),5,FALSE)), \"0\", VLOOKUP(E95,INDIRECT(\"'\"&$K$1&\"'!$A$1:$H$550\"),5,FALSE))","v":"0"}]
["SS-2",null,null,3,"Not Found",null,null,"Not Found","0"]
["SS-3",null,null,3,"Not Found",null,null,"Not Found","0"]
["Sciences with Lab"]
["SC-1",null,null,3,{"$f":"IF(ISNA(INDEX(INDIRECT(\"'\"&$K$1&\"'!$A$1:$A$550\"), MATCH(A99,INDIRECT(\"'\"&$K$1&\"'!$B$1:$B$550\"),0))), \"Not Found\", (INDEX(INDIRECT(\"'\"&$K$1&\"'!$A$1:$A$550\"), MATCH(A99,INDIRECT(\"'\"&$K$1&\"'!$B$1:$B$550\"),0))))","v":"Not Found"},null,null,{"$f":"IF(ISNA(VLOOKUP(E99,INDIRECT(\"'\"&$K$1&\"'!$A$1:$H$550\"),8,FALSE)), \"Not Found\", VLOOKUP(E99,INDIRECT(\"'\"&$K$1&\"'!$A$1:$H$550\"),8,FALSE))","v":"Not Found"},{"$f":"IF(ISNA(VLOOKUP(E99,INDIRECT(\"'\"&$K$1&\"'!$A$1:$H$550\"),5,FALSE)), \"0\", VLOOKUP(E99,INDIRECT(\"'\"&$K$1&\"'!$A$1:$H$550\"),5,FALSE))","v":"0"}]
["SCL-1",null,null,1,"Not Found",null,null,"Not Found","0"]
["SC-2",null,null,3,"Not Found",null,null,"Not Found","0"]
["SCL-2",null,null,1,"Not Found",null,null,"Not Found","0"]
["STEM"]
["STEM",null,null,3,{"$f":"IF(ISNA(INDEX(INDIRECT(\"'\"&$K$1&\"'!$A$1:$A$550\"), MATCH(A104,INDIRECT(\"'\"&$K$1&\"'!$B$1:$B$550\"),0))), \"Not Found\", (INDEX(INDIRECT(\"'\"&$K$1&\"'!$A$1:$A$550\"), MATCH(A104,INDIRECT(\"'\"&$K$1&\"'!$B$1:$B$550\"),0))))","v":"Not Found"},null,null,{"$f":"IF(ISNA(VLOOKUP(E104,INDIRECT(\"'\"&$K$1&\"'!$A$1:$H$550\"),8,FALSE)), \"Not Found\", VLOOKUP(E104,INDIRECT(\"'\"&$K$1&\"'!$A$1:$H$550\"),8,FALSE))","v":"Not Found"},{"$f":"IF(ISNA(VLOOKUP(E104,INDIRECT(\"'\"&$K$1&\"'!$A$1:$H$550\"),5,FALSE)), \"0\", VLOOKUP(E104,INDIRECT(\"'\"&$K$1&\"'!$A$1:$H$550\"),5,FALSE))","v":"0"}]
[]
["Diversity & Ethics ELOs"]
["Diversity & Cultural Awareness (DV)"]
["DV",null,null,3,{"$f":"IF(ISNA(INDEX(INDIRECT(\"'\"&$K$1&\"'!$A$1:$A$550\"), MATCH(\"*\"&A108&\"*\",INDIRECT(\"'\"&$K$1&\"'!$B$1:$B$550\"),0))), \"Not Found\", (INDEX(INDIRECT(\"'\"&$K$1&\"'!$A$1:$A$550\"), MATCH(\"*\"&A108&\"*\",INDIRECT(\"'\"&$K$1&\"'!$B$1:$B$550\"),0))))","v":"Not Found"},null,null,{"$f":"IF(ISNA(VLOOKUP(E108,INDIRECT(\"'\"&$K$1&\"'!$A$1:$H$550\"),8,FALSE)), \"Not Found\", VLOOKUP(E108,INDIRECT(\"'\"&$K$1&\"'!$A$1:$H$550\"),8,FALSE))","v":"Not Found"},{"$f":"IF(ISNA(VLOOKUP(E108,INDIRECT(\"'\"&$K$1&\"'!$A$1:$H$550\"),5,FALSE)), \"0\", VLOOKUP(E108,INDIRECT(\"'\"&$K$1&\"'!$A$1:$H$550\"),5,FALSE))","v":"0"}]
["Social Responsibility & Ethics (ET)"]
["ET",null,null,3,{"$f":"IF(ISNA(INDEX(INDIRECT(\"'\"&$K$1&\"'!$A$1:$A$550\"), MATCH(\"*\"&A110&\"*\",INDIRECT(\"'\"&$K$1&\"'!$B$1:$B$550\"),0))), \"Not Found\", (INDEX(INDIRECT(\"'\"&$K$1&\"'!$A$1:$A$550\"), MATCH(\"*\"&A110&\"*\",INDIRECT(\"'\"&$K$1&\"'!$B$1:$B$550\"),0))))","v":"Not Found"},null,null,{"$f":"IF(ISNA(VLOOKUP(E110,INDIRECT(\"'\"&$K$1&\"'!$A$1:$H$550\"),8,FALSE)), \"Not Found\", VLOOKUP(E110,INDIRECT(\"'\"&$K$1&\"'!$A$1:$H$550\"),8,FALSE))","v":"Not Found"},{"$f":"IF(ISNA(VLOOKUP(E110,INDIRECT(\"'\"&$K$1&\"'!$A$1:$H$550\"),5,FALSE)), \"0\", VLOOKUP(E110,INDIRECT(\"'\"&$K$1&\"'!$A$1:$H$550\"),5,FALSE))","v":"0"}]
[]
["Degree Credits",null,null,null,null,null,null,null,"Projected Degree Credits "]
[null,null,null,{"$f":"SUM(D1:D45,D53:D70,D86,D87,D91:D97)","v":120},null,null,null,null,{"$f":"SUM(I1:I45, I53:I57,I73,I86,I87,I91:I97)","v":0}]

{"sheet":"Graduation_Plan-General","index":9,"n_rows":399,"n_cols":8,"rows_kept":399,"cut":false,"hidden":true,"merged":[[3,0,3,1],[3,2,3,5],[0,0,0,5],[1,0,1,1],[1,2,1,5],[2,0,2,1],[2,2,2,5],[4,0,4,1],[4,2,4,5],[5,0,5,1],[5,2,5,5],[6,0,6,1],[6,2,6,5],[13,0,13,6],[7,0,7,1],[7,2,7,5],[8,0,8,1],[8,2,8,5],[9,0,9,1],[9,2,9,5],[10,0,10,6],[11,0,11,3],[11,4,11,5],[12,0,12,3],[12,4,12,5],[96,2,96,5],[14,0,14,3],[15,0,15,6],[16,0,16,5],[17,0,17,5],[69,0,69,2],[70,0,70,2],[71,0,71,6],[72,0,72,5],[73,2,73,5],[87,0,87,6],[88,2,88,5],[172,0,172,5],[110,0,110,6],[111,2,111,5],[121,0,121,6],[122,0,122,5],[123,2,123,5],[137,0,137,6],[138,2,138,5],[146,2,146,5],[160,0,160,6],[161,2,161,5],[171,0,171,6],[246,2,246,5],[173,2,173,6],[187,0,187,6],[188,2,188,5],[196,2,196,5],[210,0,210,6],[211,2,211,5],[221,0,221,6],[222,0,222,5],[223,2,223,5],[237,0,237,6],[238,2,238,5],[322,0,322,5],[260,0,260,6],[261,2,261,5],[271,0,271,6],[272,0,272,5],[273,2,273,5],[287,0,287,6],[288,2,288,5],[296,2,296,5],[310,0,310,6],[311,2,311,5],[321,0,321,6],[379,1,380,3],[379,4,380,4],[323,2,323,5],[337,0,337,6],[338,2,338,5],[346,2,346,5],[360,0,360,6],[361,2,361,5],[371,0,371,6],[373,1,373,4],[375,1,376,3],[375,4,376,4],[377,1,377,3],[399,1,399,4],[381,1,381,3],[383,1,384,3],[383,4,384,4],[385,1,385,3],[387,1,388,3],[387,4,388,4],[389,1,389,3],[391,1,392,3],[391,4,392,4],[393,1,393,3],[398,1,398,4]]}
["Computer Science Graduation Plan"]
["Student Name",null,"Last Name, First Name"]
["University Id (not ss#)"]
["Email"]
["Primary Major (Option)",null,"Computer Science (General Option)"]
["Second Major:"]
["Third Major:"]
["Minors(s):"]
["Special Program(s):"]
["Scholarships:"]
[]
["Matriculation Date (Month/Year)",null,null,null,"Sept. 2016"]
["Expected Graduation Date (Month/Year)",null,null,null,"June 2020"]
[]
["Minimum Number of Credits Required for Degree(s)",null,null,null,120]
[]
["Transfer and AP Credits"]
[]
["Course","Req.","Req.","Course Title","Credits","Grade","Degree Credits","SemesterYear"]
[null,null,null,null,null,null,null,"Transfer/AP"]
[null,null,null,null,null,null,null,"Transfer/AP"]
[null,null,null,null,null,null,null,"Transfer/AP"]
[null,null,null,null,null,null,null,"Transfer/AP"]
[null,null,null,null,null,null,null,"Transfer/AP"]
[null,null,null,null,null,null,null,"Transfer/AP"]
[null,null,null,null,null,null,null,"Transfer/AP"]
[null,null,null,null,null,null,null,"Transfer/AP"]
[null,null,null,null,null,null,null,"Transfer/AP"]
[null,null,null,null,null,null,null,"Transfer/AP"]
[null,null,null,null,null,null,null,"Transfer/AP"]
[null,null,null,null,null,null,null,"Transfer/AP"]
[null,null,null,null,null,null,null,"Transfer/AP"]
[null,null,null,null,null,null,null,"Transfer/AP"]
[null,null,null,null,null,null,null,"Transfer/AP"]
[null,null,null,null,null,null,null,"Transfer/AP"]
[null,null,null,null,null,null,null,"Transfer/AP"]
[null,null,null,null,null,null,null,"Transfer/AP"]
[null,null,null,null,null,null,null,"Transfer/AP"]
[null,null,null,null,null,null,null,"Transfer/AP"]
[null,null,null,null,null,null,null,"Transfer/AP"]
[null,null,null,null,null,null,null,"Transfer/AP"]
[null,null,null,null,null,null,null,"Transfer/AP"]
[null,null,null,null,null,null,null,"Transfer/AP"]
[null,null,null,null,null,null,null,"Transfer/AP"]
[null,null,null,null,null,null,null,"Transfer/AP"]
[null,null,null,null,null,null,null,"Transfer/AP"]
[null,null,null,null,null,null,null,"Transfer/AP"]
[null,null,null,null,null,null,null,"Transfer/AP"]
[null,null,null,null,null,null,null,"Transfer/AP"]
[null,null,null,null,null,null,null,"Transfer/AP"]
[null,null,null,null,null,null,null,"Transfer/AP"]
[null,null,null,null,null,null,null,"Transfer/AP"]
[null,null,null,null,null,null,null,"Transfer/AP"]
[null,null,null,null,null,null,null,"Transfer/AP"]
[null,null,null,null,null,null,null,"Transfer/AP"]
[null,null,null,null,null,null,null,"Transfer/AP"]
[null,null,null,null,null,null,null,"Transfer/AP"]
[null,null,null,null,null,null,null,"Transfer/AP"]
[null,null,null,null,null,null,null,"Transfer/AP"]
[null,null,null,null,null,null,null,"Transfer/AP"]
[null,null,null,null,null,null,null,"Transfer/AP"]
[null,null,null,null,null,null,null,"Transfer/AP"]
[null,null,null,null,null,null,null,"Transfer/AP"]
[null,null,null,null,null,null,null,"Transfer/AP"]
[null,null,null,null,null,null,null,"Transfer/AP"]
[null,null,null,null,null,null,null,"Transfer/AP"]
[null,null,null,null,null,null,null,"Transfer/AP"]
[null,null,null,null,null,null,null,"Transfer/AP"]
[null,null,null,null,null,null,null,"Transfer/AP"]
[" "," ",null,"Transfer and AP Credits",{"$f":"SUM(E20:E69)","v":0},null,{"$f":"SUM(G20:G69)","v":0}]
[" "," ",null,"Total Credits Earned",{"$f":"E70","v":0},null,{"$f":"E15-G70","v":120}]
[]
["Year 1"]
["Fall","2016",{"$f":"C2","v":"Last Name, First Name"}]
["Course",{"$f":"B19","v":"Req."},{"$f":"C19","v":"Req."},"Course Title","Credits","Grade","Degree Credits","SemesterYear"]
[null,null,null,null,null,null,null,{"$f":"$A$74&$B$74","v":"Fall2016"}]
[null,null,null,null,null,null,null,{"$f":"$A$74&$B$74","v":"Fall2016"}]
[null,null,null,null,null,null,null,"Fall2016"]
[null,null,null,null,null,null,null,"Fall2016"]
[null,null,null,null,null,null,null,"Fall2016"]
[null,null,null,null,null,null,null,"Fall2016"]
[null,null,null,null,null,null,null,"Fall2016"]
[null,null,null,null,null,null,null,"Fall2016"]
[null,null,null,null,null,null,null,"Fall2016"]
[null,null,null,null,null,null,null,"Fall2016"]
[" "," ",null,"Semester Credits Earned",{"$f":"SUM(E76:E85)","v":0},null,{"$f":"SUM(G76:G85)","v":0}]
[" "," ",null,{"$f":"D71","v":"Total Credits Earned"},{"$f":"E71+E86","v":0},null,{"$f":"G71-G86","v":120}]
[]
["Winter",{"$f":"B74+1","v":2017},{"$f":"C2","v":"Last Name, First Name"}]
["Course",{"$f":"B19","v":"Req."},null,"Course Title","Credits","Grade","Degree Credits","SemesterYear"]
[null,null,null,null,null,null,null,{"$f":"$A$89&$B$89","v":"Winter2017"}]
[null,null,null,null,null,null,null,{"$f":"$A$89&$B$89","v":"Winter2017"}]
[null,null,null,null,null,null,null,"Winter2017"]
[" "," ",null,{"$f":"D86","v":"Semester Credits Earned"},{"$f":"SUM(E91:E93)","v":0},null,{"$f":"SUM(G91:G93)","v":0}]
[" "," ",null,{"$f":"D71","v":"Total Credits Earned"},{"$f":"E87+E94","v":0},null,{"$f":"G87-G94","v":120}]
[]
["Spring",{"$f":"B74+1","v":2017},{"$f":"C2","v":"Last Name, First Name"}]
["Course",{"$f":"B19","v":"Req."},{"$f":"C19","v":"Req."},"Course Title","Credits","Grade","Degree Credits","SemesterYear"]
[null,null,null,null,null,null,null,{"$f":"$A$97&$B$97","v":"Spring2017"}]
[null,null,null,null,null,null,null,{"$f":"$A$97&$B$97","v":"Spring2017"}]
[null,null,null,null,null,null,null,"Spring2017"]
[null,null,null,null,null,null,null,"Spring2017"]
[null,null,null,null,null,null,null,"Spring2017"]
[null,null,null,null,null,null,null,"Spring2017"]
[null,null,null,null,null,null,null,"Spring2017"]
[null,null,null,null,null,null,null,"Spring2017"]
[null,null,null,null,null,null,null,"Spring2017"]
[null,null,null,null,null,null,null,"Spring2017"]
[" "," ",null,{"$f":"D86","v":"Semester Credits Earned"},{"$f":"SUM(E99:E108)","v":0},null,{"$f":"SUM(G99:G108)","v":0}]
[" "," ",null,{"$f":"D71","v":"Total Credits Earned"},{"$f":"E95+E109","v":0},null,{"$f":"G95-G109","v":120}]
[]
["Summer",{"$f":"B74+1","v":2017},{"$f":"C2","v":"Last Name, First Name"}]
["Course",{"$f":"B19","v":"Req."},{"$f":"C19","v":"Req."},"Course Title","Credits","Grade","Degree Credits","SemesterYear"]
[null,null,null,null,null,null,null,{"$f":"$A$112&$B$112","v":"Summer2017"}]
[null,null,null,null,null,null,null,{"$f":"$A$112&$B$112","v":"Summer2017"}]
[null,null,null,null,null,null,null,"Summer2017"]
[null,null,null,null,null,null,null,"Summer2017"]
[null,null,null,null,null,null,null,"Summer2017"]
[null,null,null,null,null,null,null,"Summer2017"]
[" "," ",null,{"$f":"D86","v":"Semester Credits Earned"},{"$f":"SUM(E114:E119)","v":0},null,{"$f":"SUM(G114:G119)","v":0}]
[" "," ",null,{"$f":"D71","v":"Total Credits Earned"},{"$f":"E110+E120","v":0},null,{"$f":"G110-G120","v":120}]
[]
["Year 2"]
["Fall",{"$f":"B74+1","v":2017},{"$f":"C2","v":"Last Name, First Name"}]
["Course",{"$f":"B19","v":"Req."},{"$f":"C19","v":"Req."},"Course Title","Credits","Grade","Degree Credits","SemesterYear"]
[null,null,null,null,null,null,null,{"$f":"$A$124&$B$124","v":"Fall2017"}]
[null,null,null,null,null,null,null,{"$f":"$A$124&$B$124","v":"Fall2017"}]
[null,null,null,null,null,null,null,"Fall2017"]
[null,null,null,null,null,null,null,"Fall2017"]
[null,null,null,null,null,null,null,"Fall2017"]
[null,null,null,null,null,null,null,"Fall2017"]
[null,null,null,null,null,null,null,"Fall2017"]
[null,null,null,null,null,null,null,"Fall2017"]
[null,null,null,null,null,null,null,"Fall2017"]
[null,null,null,null,null,null,null,"Fall2017"]
[" "," ",null,{"$f":"D86","v":"Semester Credits Earned"},{"$f":"SUM(E126:E135)","v":0},null,{"$f":"SUM(G126:G135)","v":0}]
[" "," ",null,{"$f":"D71","v":"Total Credits Earned"},{"$f":"E121+E136","v":0},null,{"$f":"G121-G136","v":120}]
[]
["Winter",{"$f":"B74+2","v":2018},{"$f":"C2","v":"Last Name, First Name"}]
["Course",{"$f":"B19","v":"Req."},{"$f":"C19","v":"Req."},"Course Title","Credits","Grade","Degree Credits","SemesterYear"]
[null,null,null,null,null,null,null,{"$f":"$A$139&$B$139","v":"Winter2018"}]
[null,null,null,null,null,null,null,{"$f":"$A$139&$B$139","v":"Winter2018"}]
[null,null,null,null,null,null,null,"Winter2018"]
[" "," ",null,{"$f":"D86","v":"Semester Credits Earned"},{"$f":"SUM(E141:E143)","v":0},null,{"$f":"SUM(G141:G143)","v":0}]
[" "," ",null,{"$f":"D71","v":"Total Credits Earned"},{"$f":"E137+E144","v":0},null,{"$f":"G137-G144","v":120}]
[]
["Spring",{"$f":"B89+1","v":2018},{"$f":"C2","v":"Last Name, First Name"}]
["Course",{"$f":"B19","v":"Req."},{"$f":"C19","v":"Req."},"Course Title","Credits","Grade","Degree Credits","SemesterYear"]
[null,null,null,null,null,null,null,{"$f":"$A$147&$B$147","v":"Spring2018"}]
[null,null,null,null,null,null,null,{"$f":"$A$147&$B$147","v":"Spring2018"}]
[null,null,null,null,null,null,null,"Spring2018"]
[null,null,null,null,null,null,null,"Spring2018"]
[null,null,null,null,null,null,null,"Spring2018"]
[null,null,null,null,null,null,null,"Spring2018"]
[null,null,null,null,null,null,null,"Spring2018"]
[null,null,null,null,null,null,null,"Spring2018"]
[null,null,null,null,null,null,null,"Spring2018"]
[null,null,null,null,null,null,null,"Spring2018"]
[" "," ",null,{"$f":"D86","v":"Semester Credits Earned"},{"$f":"SUM(E149:E158)","v":0},null,{"$f":"SUM(G149:G158)","v":0}]
[" "," ",null,{"$f":"D71","v":"Total Credits Earned"},{"$f":"E145+E159","v":0},null,{"$f":"G145-G159","v":120}]
[]
["Summer",{"$f":"B74+2","v":2018},{"$f":"C2","v":"Last Name, First Name"}]
["Course",{"$f":"B19","v":"Req."},{"$f":"C19","v":"Req."},"Course Title","Credits","Grade","Degree Credits","SemesterYear"]
[null,null,null,null,null,null,null,{"$f":"$A$162&$B$162","v":"Summer2018"}]
[null,null,null,null,null,null,null,{"$f":"$A$162&$B$162","v":"Summer2018"}]
[null,null,null,null,null,null,null,"Summer2018"]
[null,null,null,null,null,null,null,"Summer2018"]
[null,null,null,null,null,null,null,"Summer2018"]
[null,null,null,null,null,null,null,"Summer2018"]
[" "," ",null,{"$f":"D86","v":"Semester Credits Earned"},{"$f":"SUM(E164:E169)","v":0},null,{"$f":"SUM(G163:G169)","v":0}]
[" "," ",null,{"$f":"D71","v":"Total Credits Earned"},{"$f":"E160+E170","v":0},null,{"$f":"G160-G170","v":120}]
[]
["Year 3"]
["Fall",{"$f":"B74+2","v":2018},{"$f":"C2","v":"Last Name, First Name"}]
["Course",{"$f":"B19","v":"Req."},{"$f":"C19","v":"Req."},"Course Title","Credits","Grade","Degree Credits","SemesterYear"]
[null,null,null,null,null,null,null,{"$f":"$A$174&$B$174","v":"Fall2018"}]
[null,null,null,null,null,null,null,{"$f":"$A$174&$B$174","v":"Fall2018"}]
[null,null,null,null,null,null,null,"Fall2018"]
[null,null,null,null,null,null,null,"Fall2018"]
[null,null,null,null,null,null,null,"Fall2018"]
[null,null,null,null,null,null,null,"Fall2018"]
[null,null,null,null,null,null,null,"Fall2018"]
[null,null,null,null,null,null,null,"Fall2018"]
[null,null,null,null,null,null,null,"Fall2018"]
[null,null,null,null,null,null,null,"Fall2018"]
[" "," ",null,{"$f":"D86","v":"Semester Credits Earned"},{"$f":"SUM(E176:E185)","v":0},null,{"$f":"SUM(G176:G185)","v":0}]
[" "," ",null,{"$f":"D71","v":"Total Credits Earned"},{"$f":"E171+E186","v":0},null,{"$f":"G171-G186","v":120}]
[]
["Winter",{"$f":"B74+3","v":2019},{"$f":"C2","v":"Last Name, First Name"}]
["Course",{"$f":"B19","v":"Req."},{"$f":"C19","v":"Req."},"Course Title","Credits","Grade","Degree Credits","SemesterYear"]
[null,null,null,null,null,null,null,{"$f":"$A$189&$B$189","v":"Winter2019"}]
[null,null,null,null,null,null,null,{"$f":"$A$189&$B$189","v":"Winter2019"}]
[null,null,null,null,null,null,null,"Winter2019"]
[" "," ",null,{"$f":"D86","v":"Semester Credits Earned"},{"$f":"SUM(E191:E193)","v":0},null,{"$f":"SUM(G191:G193)","v":0},{"$f":"SUM(H191:H193)","v":0}]
[" "," ",null,{"$f":"D71","v":"Total Credits Earned"},{"$f":"E187+E194","v":0},null,{"$f":"G187-G194","v":120}]
[]
["Spring",{"$f":"B74+3","v":2019},{"$f":"C2","v":"Last Name, First Name"}]
["Course",{"$f":"B19","v":"Req."},{"$f":"C19","v":"Req."},"Course Title","Credits","Grade","Degree Credits","SemesterYear"]
[null,null,null,null,null,null,null,{"$f":"$A$197&$B$197","v":"Spring2019"}]
[null,null,null,null,null,null,null,{"$f":"$A$197&$B$197","v":"Spring2019"}]
[null,null,null,null,null,null,null,"Spring2019"]
[null,null,null,null,null,null,null,"Spring2019"]
[null,null,null,null,null,null,null,"Spring2019"]
[null,null,null,null,null,null,null,"Spring2019"]
[null,null,null,null,null,null,null,"Spring2019"]
[null,null,null,null,null,null,null,"Spring2019"]
[null,null,null,null,null,null,null,"Spring2019"]
[null,null,null,null,null,null,null,"Spring2019"]
[" "," ",null,{"$f":"D86","v":"Semester Credits Earned"},{"$f":"SUM(E199:E208)","v":0},null,{"$f":"SUM(G199:G208)","v":0}]
[" "," ",null,{"$f":"D71","v":"Total Credits Earned"},{"$f":"E195+E209","v":0},null,{"$f":"G195-G209","v":120}]
[]
["Summer",{"$f":"B74+3","v":2019},{"$f":"C2","v":"Last Name, First Name"}]
["Course",{"$f":"B19","v":"Req."},{"$f":"C19","v":"Req."},"Course Title","Credits","Grade","Degree Credits","SemesterYear"]
[null,null,null,null,null,null,null,{"$f":"$A$212&$B$212","v":"Summer2019"}]
[null,null,null,null,null,null,null,{"$f":"$A$212&$B$212","v":"Summer2019"}]
[null,null,null,null,null,null,null,"Summer2019"]
[null,null,null,null,null,null,null,"Summer2019"]
[null,null,null,null,null,null,null,"Summer2019"]
[null,null,null,null,null,null,null,"Summer2019"]
[" "," ",null,{"$f":"D86","v":"Semester Credits Earned"},{"$f":"SUM(E214:E219)","v":0},null,{"$f":"SUM(G213:G219)","v":0}]
[" "," ",null,{"$f":"D71","v":"Total Credits Earned"},{"$f":"E210+E220","v":0},null,{"$f":"G210-G220","v":120}]
[]
["Year 4"]
["Fall",{"$f":"B74+3","v":2019},{"$f":"C2","v":"Last Name, First Name"}]
["Course",{"$f":"B19","v":"Req."},{"$f":"C19","v":"Req."},"Course Title","Credits","Grade","Degree Credits","SemesterYear"]
[null,null,null,null,null,null,null,{"$f":"$A$224&$B$224","v":"Fall2019"}]
[null,null,null,null,null,null,null,{"$f":"$A$224&$B$224","v":"Fall2019"}]
[null,null,null,null,null,null,null,"Fall2019"]
[null,null,null,null,null,null,null,"Fall2019"]
[null,null,null,null,null,null,null,"Fall2019"]
[null,null,null,null,null,null,null,"Fall2019"]
[null,null,null,null,null,null,null,"Fall2019"]
[null,null,null,null,null,null,null,"Fall2019"]
[null,null,null,null,null,null,null,"Fall2019"]
[null,null,null,null,null,null,null,"Fall2019"]
[" "," ",null,{"$f":"D86","v":"Semester Credits Earned"},{"$f":"SUM(E226:E235)","v":0},null,{"$f":"SUM(G226:G235)","v":0}]
[" "," ",null,{"$f":"D71","v":"Total Credits Earned"},{"$f":"E221+E236","v":0},null,{"$f":"G221-G236","v":120}]
[]
["Winter",{"$f":"B74+4","v":2020},{"$f":"C2","v":"Last Name, First Name"}]
["Course",{"$f":"B19","v":"Req."},{"$f":"C19","v":"Req."},"Course Title","Credits","Grade","Degree Credits","SemesterYear"]
[null,null,null,null,null,null,null,{"$f":"$A$239&$B$239","v":"Winter2020"}]
[null,null,null,null,null,null,null,{"$f":"$A$239&$B$239","v":"Winter2020"}]
[null,null,null,null,null,null,null,"Winter2020"]
[" "," ",null,{"$f":"D86","v":"Semester Credits Earned"},{"$f":"SUM(E241:E243)","v":0},null,{"$f":"SUM(G241:G243)","v":0}]
[" "," ",null,{"$f":"D71","v":"Total Credits Earned"},{"$f":"E237+E244","v":0},null,{"$f":"G237-G244","v":120}]
[]
["Spring",{"$f":"B74+4","v":2020},{"$f":"C2","v":"Last Name, First Name"}]
["Course",{"$f":"B19","v":"Req."},{"$f":"C19","v":"Req."},"Course Title","Credits","Grade","Degree Credits","SemesterYear"]
[null,null,null,null,null,null,null,{"$f":"$A$247&$B$247","v":"Spring2020"}]
[null,null,null,null,null,null,null,{"$f":"$A$247&$B$247","v":"Spring2020"}]
[null,null,null,null,null,null,null,"Spring2020"]
[null,null,null,null,null,null,null,"Spring2020"]
[null,null,null,null,null,null,null,"Spring2020"]
[null,null,null,null,null,null,null,"Spring2020"]
[null,null,null,null,null,null,null,"Spring2020"]
[null,null,null,null,null,null,null,"Spring2020"]
[null,null,null,null,null,null,null,"Spring2020"]
[null,null,null,null,null,null,null,"Spring2020"]
[" "," ",null,{"$f":"D86","v":"Semester Credits Earned"},{"$f":"SUM(E249:E258)","v":0},null,{"$f":"SUM(G249:G258)","v":0}]
[" "," ",null,{"$f":"D71","v":"Total Credits Earned"},{"$f":"E245+E259","v":0},null,{"$f":"G245-G259","v":120}]
[]
["Summer",{"$f":"B74+4","v":2020},{"$f":"C2","v":"Last Name, First Name"}]
["Course",{"$f":"B19","v":"Req."},{"$f":"C19","v":"Req."},"Course Title","Credits","Grade","Degree Credits","SemesterYear"]
[null,null,null,null,null,null,null,{"$f":"$A$262&$B$262","v":"Summer2020"}]
[null,null,null,null,null,null,null,{"$f":"$A$262&$B$262","v":"Summer2020"}]
[null,null,null,null,null,null,null,"Summer2020"]
[null,null,null,null,null,null,null,"Summer2020"]
[null,null,null,null,null,null,null,"Summer2020"]
[null,null,null,null,null,null,null,"Summer2020"]
[" "," ",null,{"$f":"D86","v":"Semester Credits Earned"},{"$f":"SUM(E264:E269)","v":0},null,{"$f":"SUM(G263:G269)","v":0}]
[" "," ",null,{"$f":"D71","v":"Total Credits Earned"},{"$f":"E260+E270","v":0},null,{"$f":"G260-G270","v":120}]
[]
["Year 5"]
["Fall",{"$f":"B74+4","v":2020},{"$f":"C2","v":"Last Name, First Name"}]
["Course",{"$f":"B19","v":"Req."},{"$f":"C19","v":"Req."},"Course Title","Credits","Grade","Degree Credits","SemesterYear"]
[null,null,null,null,null,null,null,{"$f":"$A$274&$B$274","v":"Fall2020"}]
[null,null,null,null,null,null,null,{"$f":"$A$274&$B$274","v":"Fall2020"}]
[null,null,null,null,null,null,null,"Fall2020"]
[null,null,null,null,null,null,null,"Fall2020"]
[null,null,null,null,null,null,null,"Fall2020"]
[null,null,null,null,null,null,null,"Fall2020"]
[null,null,null,null,null,null,null,"Fall2020"]
[null,null,null,null,null,null,null,"Fall2020"]
[null,null,null,null,null,null,null,"Fall2020"]
[null,null,null,null,null,null,null,"Fall2020"]
[" "," ",null,{"$f":"D86","v":"Semester Credits Earned"},{"$f":"SUM(E276:E285)","v":0},null,{"$f":"SUM(G276:G285)","v":0}]
[" "," ",null,{"$f":"D71","v":"Total Credits Earned"},{"$f":"E271+E286","v":0},null,{"$f":"G271-G286","v":120}]
[]
["Winter",{"$f":"B74+5","v":2021},{"$f":"C2","v":"Last Name, First Name"}]
["Course",{"$f":"B19","v":"Req."},{"$f":"C19","v":"Req."},"Course Title","Credits","Grade","Degree Credits","SemesterYear"]
[null,null,null,null,null,null,null,{"$f":"$A$289&$B$289","v":"Winter2021"}]
[null,null,null,null,null,null,null,{"$f":"$A$289&$B$289","v":"Winter2021"}]
[null,null,null,null,null,null,null,"Winter2021"]
[" "," ",null,{"$f":"D86","v":"Semester Credits Earned"},{"$f":"SUM(E291:E293)","v":0},null,{"$f":"SUM(G291:G293)","v":0}]
[" "," ",null,{"$f":"D71","v":"Total Credits Earned"},{"$f":"E287+E294","v":0},null,{"$f":"G287-G294","v":120}]
[]
["Spring",{"$f":"B74+5","v":2021},{"$f":"C2","v":"Last Name, First Name"}]
["Course",{"$f":"B19","v":"Req."},{"$f":"C19","v":"Req."},"Course Title","Credits","Grade","Degree Credits","SemesterYear"]
[null,null,null,null,null,null,null,{"$f":"$A$297&$B$297","v":"Spring2021"}]
[null,null,null,null,null,null,null,{"$f":"$A$297&$B$297","v":"Spring2021"}]
[null,null,null,null,null,null,null,"Spring2021"]
[null,null,null,null,null,null,null,"Spring2021"]
[null,null,null,null,null,null,null,"Spring2021"]
[null,null,null,null,null,null,null,"Spring2021"]
[null,null,null,null,null,null,null,"Spring2021"]
[null,null,null,null,null,null,null,"Spring2021"]
[null,null,null,null,null,null,null,"Spring2021"]
[null,null,null,null,null,null,null,"Spring2021"]
[" "," ",null,{"$f":"D86","v":"Semester Credits Earned"},{"$f":"SUM(E299:E308)","v":0},null,{"$f":"SUM(G299:G308)","v":0}]
[" "," ",null,{"$f":"D71","v":"Total Credits Earned"},{"$f":"E295+E309","v":0},null,{"$f":"G295-G309","v":120}]
[]
["Summer",{"$f":"B74+5","v":2021},{"$f":"C2","v":"Last Name, First Name"}]
["Course",{"$f":"B19","v":"Req."},{"$f":"C19","v":"Req."},"Course Title","Credits","Grade","Degree Credits","SemesterYear"]
[null,null,null,null,null,null,null,{"$f":"$A$312&$B$312","v":"Summer2021"}]
[null,null,null,null,null,null,null,{"$f":"$A$312&$B$312","v":"Summer2021"}]
[null,null,null,null,null,null,null,"Summer2021"]
[null,null,null,null,null,null,null,"Summer2021"]
[null,null,null,null,null,null,null,"Summer2021"]
[null,null,null,null,null,null,null,"Summer2021"]
[" "," ",null,{"$f":"D86","v":"Semester Credits Earned"},{"$f":"SUM(E314:E319)","v":0},null,{"$f":"SUM(G313:G319)","v":0}]
[" "," ",null,{"$f":"D71","v":"Total Credits Earned"},{"$f":"E310+E320","v":0},null,{"$f":"G310-G320","v":120}]
[]
["Year 6"]
["Fall",{"$f":"B74+5","v":2021},{"$f":"C2","v":"Last Name, First Name"}]
["Course",{"$f":"B19","v":"Req."},{"$f":"C19","v":"Req."},"Course Title","Credits","Grade","Degree Credits","SemesterYear"]
[null,null,null,null,null,null,null,{"$f":"$A$324&$B$324","v":"Fall2021"}]
[null,null,null,null,null,null,null,{"$f":"$A$324&$B$324","v":"Fall2021"}]
[null,null,null,null,null,null,null,"Fall2021"]
[null,null,null,null,null,null,null,"Fall2021"]
[null,null,null,null,null,null,null,"Fall2021"]
[null,null,null,null,null,null,null,"Fall2021"]
[null,null,null,null,null,null,null,"Fall2021"]
[null,null,null,null,null,null,null,"Fall2021"]
[null,null,null,null,null,null,null,"Fall2021"]
[null,null,null,null,null,null,null,"Fall2021"]
[" "," ",null,{"$f":"D136","v":"Semester Credits Earned"},{"$f":"SUM(E326:E335)","v":0},null,{"$f":"SUM(G326:G335)","v":0}]
[" "," ",null,{"$f":"D121","v":"Total Credits Earned"},{"$f":"E321+E336","v":0},null,{"$f":"G321-G336","v":120}]
[]
["Winter",{"$f":"B74+6","v":2022},{"$f":"C2","v":"Last Name, First Name"}]
["Course",{"$f":"B19","v":"Req."},{"$f":"C19","v":"Req."},"Course Title","Credits","Grade","Degree Credits","SemesterYear"]
[null,null,null,null,null,null,null,{"$f":"$A$339&$B$339","v":"Winter2022"}]
[null,null,null,null,null,null,null,{"$f":"$A$339&$B$339","v":"Winter2022"}]
[null,null,null,null,null,null,null,"Winter2022"]
[" "," ",null,{"$f":"D136","v":"Semester Credits Earned"},{"$f":"SUM(E341:E343)","v":0},null,{"$f":"SUM(G341:G343)","v":0}]
[" "," ",null,{"$f":"D121","v":"Total Credits Earned"},{"$f":"E337+E344","v":0},null,{"$f":"G337-G344","v":120}]
[]
["Spring",{"$f":"B74+6","v":2022},{"$f":"C2","v":"Last Name, First Name"}]
["Course",{"$f":"B19","v":"Req."},{"$f":"C19","v":"Req."},"Course Title","Credits","Grade","Degree Credits","SemesterYear"]
[null,null,null,null,null,null,null,{"$f":"$A$347&$B$347","v":"Spring2022"}]
[null,null,null,null,null,null,null,{"$f":"$A$347&$B$347","v":"Spring2022"}]
[null,null,null,null,null,null,null,"Spring2022"]
[null,null,null,null,null,null,null,"Spring2022"]
[null,null,null,null,null,null,null,"Spring2022"]
[null,null,null,null,null,null,null,"Spring2022"]
[null,null,null,null,null,null,null,"Spring2022"]
[null,null,null,null,null,null,null,"Spring2022"]
[null,null,null,null,null,null,null,"Spring2022"]
[null,null,null,null,null,null,null,"Spring2022"]
[" "," ",null,{"$f":"D136","v":"Semester Credits Earned"},{"$f":"SUM(E349:E358)","v":0},null,{"$f":"SUM(G349:G358)","v":0}]
[" "," ",null,{"$f":"D121","v":"Total Credits Earned"},{"$f":"E345+E359","v":0},null,{"$f":"G345-G359","v":120}]
[]
["Summer",{"$f":"B74+6","v":2022},{"$f":"C2","v":"Last Name, First Name"}]
["Course",{"$f":"B19","v":"Req."},{"$f":"C19","v":"Req."},"Course Title","Credits","Grade","Degree Credits","SemesterYear"]
[null,null,null,null,null,null,null,{"$f":"$A$362&$B$362","v":"Summer2022"}]
[null,null,null,null,null,null,null,{"$f":"$A$362&$B$362","v":"Summer2022"}]
[null,null,null,null,null,null,null,"Summer2022"]
[null,null,null,null,null,null,null,"Summer2022"]
[null,null,null,null,null,null,null,"Summer2022"]
[null,null,null,null,null,null,null,"Summer2022"]
[" "," ",null,{"$f":"D136","v":"Semester Credits Earned"},{"$f":"SUM(E364:E369)","v":0},null,{"$f":"SUM(G363:G369)","v":0}]
[" "," ",null,{"$f":"D121","v":"Total Credits Earned"},{"$f":"E360+E370","v":0},null,{"$f":"G360-G370","v":120}]
[]
[]
[null,"Graduation Plan Review & Approval"]
[]
[]
[]
[null,"Initial Review: OASiS",null,null,"Date"]
[]
[]
[]
[null,"Additional Review: Faculty Mentor",null,null,"Date"]
[]
[null," ",null,null," "]
[]
[null,"Secondary Major Review",null,null,"Date"]
[]
[null," ",null,null," "]
[]
[null,"Final Review: OASiS Approval",null,null,"Date"]
[]
[null," ",null,null," "]
[]
[null,{"$f":"C2","v":"Last Name, First Name"},null,null,"Date"]
[]
[]
[]
[]
[null,"OASiS Comments"]

{"sheet":"Checklist_General","index":10,"n_rows":113,"n_cols":13,"rows_kept":113,"cut":false,"hidden":true,"merged":[[26,0,26,8],[0,0,0,8],[0,11,0,12],[1,0,1,2],[1,4,1,6],[1,11,1,12],[2,0,2,8],[17,0,17,8],[20,0,20,8],[24,0,24,8],[25,0,25,2],[25,4,25,6],[62,0,62,8],[62,11,62,12],[28,0,28,8],[35,0,35,8],[35,11,35,12],[36,0,36,2],[36,4,36,6],[36,11,36,12],[50,0,50,8],[50,11,50,12],[51,0,51,2],[51,4,51,6],[51,11,51,12],[83,0,83,2],[83,4,83,6],[83,11,83,12],[63,0,63,2],[63,4,63,6],[63,11,63,12],[64,11,64,12],[74,0,74,8],[75,0,75,2],[75,4,75,6],[78,0,78,8],[79,0,79,2],[79,4,79,6],[82,0,82,8],[82,11,82,12],[105,0,105,8],[106,0,106,8],[108,0,108,8],[84,0,84,8],[87,0,87,8],[89,0,89,8],[93,0,93,8],[97,0,97,8],[102,0,102,8]]}
["Checklist - Computer Science",null,null,null,null,null,null,null,null,null,"Graduation_Plan","Required Computer Science Electives"]
["Requirement",null,null,"Credits","Taken",null,null,"Semester","Credits",null,null,"List courses you are interested in possibly taking. (NOTE: This is not required.)"]
["Required Computer Science Courses",null,null,null,null,null,null,null,null,null,null,"Course","Title"]
["COMP.1010","or","91.101",3,"COMP.1010","or","91.101",{"$f":"IF(AND(ISNA(VLOOKUP(E4,INDIRECT(\"'\"&$K$1&\"'!$A$1:$H$550\"),8,FALSE)), ISNA(VLOOKUP(G4,INDIRECT(\"'\"&$K$1&\"'!$A$1:$H$550\"),8,FALSE))), \"Not Found\", (IF(ISNA(VLOOKUP(E4,INDIRECT(\"'\"&$K$1&\"'!$A$1:$H$550\"),8,FALSE)), VLOOKUP(G4,INDIRECT(\"'\"&$K$1&\"'!$A$1:$H$550\"),8,FALSE), VLOOKUP(E4,INDIRECT(\"'\"&$K$1&\"'!$A$1:$H$550\"),8,FALSE))))","v":"Not Found"},{"$f":"IF(AND(ISNA(VLOOKUP(E4,INDIRECT(\"'\"&$K$1&\"'!$A$1:$H$550\"),5,FALSE)), ISNA(VLOOKUP(G4,INDIRECT(\"'\"&$K$1&\"'!$A$1:$H$550\"),5,FALSE))), \"0\", (IF(ISNA(VLOOKUP(E4,INDIRECT(\"'\"&$K$1&\"'!$A$1:$H$550\"),5,FALSE)), VLOOKUP(G4,INDIRECT(\"'\"&$K$1&\"'!$A$1:$H$550\"),5,FALSE), VLOOKUP(E4,INDIRECT(\"'\"&$K$1&\"'!$A$1:$H$550\"),5,FALSE))))","v":"0"}]
["COMP.1030L","or","91.103",1,"COMP.1030L","or","91.103",{"$f":"IF(AND(ISNA(VLOOKUP(E5,INDIRECT(\"'\"&$K$1&\"'!$A$1:$H$550\"),8,FALSE)), ISNA(VLOOKUP(G5,INDIRECT(\"'\"&$K$1&\"'!$A$1:$H$550\"),8,FALSE))), \"Not Found\", (IF(ISNA(VLOOKUP(E5,INDIRECT(\"'\"&$K$1&\"'!$A$1:$H$550\"),8,FALSE)), VLOOKUP(G5,INDIRECT(\"'\"&$K$1&\"'!$A$1:$H$550\"),8,FALSE), VLOOKUP(E5,INDIRECT(\"'\"&$K$1&\"'!$A$1:$H$550\"),8,FALSE))))","v":"Not Found"},"0"]
["COMP.1020","or","91.102",3,"COMP.1020","or","91.102","Not Found",{"$f":"IF(AND(ISNA(VLOOKUP(E6,INDIRECT(\"'\"&$K$1&\"'!$A$1:$H$550\"),5,FALSE)), ISNA(VLOOKUP(G6,INDIRECT(\"'\"&$K$1&\"'!$A$1:$H$550\"),5,FALSE))), \"0\", (IF(ISNA(VLOOKUP(E6,INDIRECT(\"'\"&$K$1&\"'!$A$1:$H$550\"),5,FALSE)), VLOOKUP(G6,INDIRECT(\"'\"&$K$1&\"'!$A$1:$H$550\"),5,FALSE), VLOOKUP(E6,INDIRECT(\"'\"&$K$1&\"'!$A$1:$H$550\"),5,FALSE))))","v":"0"}]
["COMP.1040L","or","91.104",1,"COMP.1040L","or","91.104","Not Found",{"$f":"IF(AND(ISNA(VLOOKUP(E7,INDIRECT(\"'\"&$K$1&\"'!$A$1:$H$550\"),5,FALSE)), ISNA(VLOOKUP(G7,INDIRECT(\"'\"&$K$1&\"'!$A$1:$H$550\"),5,FALSE))), \"0\", (IF(ISNA(VLOOKUP(E7,INDIRECT(\"'\"&$K$1&\"'!$A$1:$H$550\"),5,FALSE)), VLOOKUP(G7,INDIRECT(\"'\"&$K$1&\"'!$A$1:$H$550\"),5,FALSE), VLOOKUP(E7,INDIRECT(\"'\"&$K$1&\"'!$A$1:$H$550\"),5,FALSE))))","v":"0"}]
["COMP.2010","or","91.201",3,"COMP.2010","or","91.201","Not Found","0"]
["COMP.2010L",null,null,1,"COMP.2010L",null,null,{"$f":"IF(AND(ISNA(VLOOKUP(E9,INDIRECT(\"'\"&$K$1&\"'!$A$1:$H$550\"),8,FALSE)), ISNA(VLOOKUP(G9,INDIRECT(\"'\"&$K$1&\"'!$A$1:$H$550\"),8,FALSE))), \"Not Found\", (IF(ISNA(VLOOKUP(E9,INDIRECT(\"'\"&$K$1&\"'!$A$1:$H$550\"),8,FALSE)), VLOOKUP(G9,INDIRECT(\"'\"&$K$1&\"'!$A$1:$H$550\"),8,FALSE), VLOOKUP(E9,INDIRECT(\"'\"&$K$1&\"'!$A$1:$H$550\"),8,FALSE))))","v":"Not Found"},{"$f":"IF(AND(ISNA(VLOOKUP(E9,INDIRECT(\"'\"&$K$1&\"'!$A$1:$H$550\"),5,FALSE)), ISNA(VLOOKUP(G9,INDIRECT(\"'\"&$K$1&\"'!$A$1:$H$550\"),5,FALSE))), \"0\", (IF(ISNA(VLOOKUP(E9,INDIRECT(\"'\"&$K$1&\"'!$A$1:$H$550\"),5,FALSE)), VLOOKUP(G9,INDIRECT(\"'\"&$K$1&\"'!$A$1:$H$550\"),5,FALSE), VLOOKUP(E9,INDIRECT(\"'\"&$K$1&\"'!$A$1:$H$550\"),5,FALSE))))","v":"0"}]
["COMP.2030","or","91.203",3,"COMP.2030","or","91.203","Not Found","0"]
["COMP.2030L",null,null,1,"COMP.2030L",null,null,{"$f":"IF(AND(ISNA(VLOOKUP(E11,INDIRECT(\"'\"&$K$1&\"'!$A$1:$H$550\"),8,FALSE)), ISNA(VLOOKUP(G11,INDIRECT(\"'\"&$K$1&\"'!$A$1:$H$550\"),8,FALSE))), \"Not Found\", (IF(ISNA(VLOOKUP(E11,INDIRECT(\"'\"&$K$1&\"'!$A$1:$H$550\"),8,FALSE)), VLOOKUP(G11,INDIRECT(\"'\"&$K$1&\"'!$A$1:$H$550\"),8,FALSE), VLOOKUP(E11,INDIRECT(\"'\"&$K$1&\"'!$A$1:$H$550\"),8,FALSE))))","v":"Not Found"},{"$f":"IF(AND(ISNA(VLOOKUP(E11,INDIRECT(\"'\"&$K$1&\"'!$A$1:$H$550\"),5,FALSE)), ISNA(VLOOKUP(G11,INDIRECT(\"'\"&$K$1&\"'!$A$1:$H$550\"),5,FALSE))), \"0\", (IF(ISNA(VLOOKUP(E11,INDIRECT(\"'\"&$K$1&\"'!$A$1:$H$550\"),5,FALSE)), VLOOKUP(G11,INDIRECT(\"'\"&$K$1&\"'!$A$1:$H$550\"),5,FALSE), VLOOKUP(E11,INDIRECT(\"'\"&$K$1&\"'!$A$1:$H$550\"),5,FALSE))))","v":"0"}]
["COMP.2040","or","91.204",3,"COMP.2040","or","91.204","Not Found","0"]
["COMP.3010","or","91.301",3,"COMP.3010","or","91.301","Not Found","0"]
["COMP.3040","or","91.304",3,"COMP.3040","or","91.304","Not Found","0"]
["COMP.3050","or","91.305",3,"COMP.3050","or","91.305","Not Found","0"]
["COMP.3080","or","91.308",3,"COMP.3080","or","91.308","Not Found","0"]
["COMP.4040","or","91.404",3,"COMP.4040","or","91.404","Not Found","0"]
["Required CS Electives"]
["CSE-1",null,null,3,{"$f":"IF(ISNA(INDEX(INDIRECT(\"'\"&$K$1&\"'!$A$1:$A$550\"), MATCH(A19,INDIRECT(\"'\"&$K$1&\"'!$B$1:$B$550\"),0))), \"Not Found\", (INDEX(INDIRECT(\"'\"&$K$1&\"'!$A$1:$A$550\"), MATCH(A19,INDIRECT(\"'\"&$K$1&\"'!$B$1:$B$550\"),0))))","v":"Not Found"},null,null,{"$f":"IF(ISNA(VLOOKUP(E19,INDIRECT(\"'\"&$K$1&\"'!$A$1:$H$550\"),8,FALSE)), \"Not Found\", VLOOKUP(E19,INDIRECT(\"'\"&$K$1&\"'!$A$1:$H$550\"),8,FALSE))","v":"Not Found"},{"$f":"IF(ISNA(VLOOKUP(E19,INDIRECT(\"'\"&$K$1&\"'!$A$1:$H$550\"),5,FALSE)), \"0\", VLOOKUP(E19,INDIRECT(\"'\"&$K$1&\"'!$A$1:$H$550\"),5,FALSE))","v":"0"}]
["CSE-2",null,null,3,"Not Found",null,null,"Not Found","0"]
["CS Project Course"]
["Sr.Prj-1",null,null,3,"Not Found",null,null,"Not Found","0"]
["Sr.Prj-2",null,null,3,"Not Found",null,null,"Not Found","0"]
[]
["Required Supporting Technical Course"]
["Requirement",null,null,"Credits","Taken",null,null,"Semester","Credits"]
["Electrical Engineering"]
["EECE.2650","or","16.265",3,"EECE.2650","or","16.265",{"$f":"IF(AND(ISNA(VLOOKUP(E28,INDIRECT(\"'\"&$K$1&\"'!$A$1:$H$550\"),8,FALSE)), ISNA(VLOOKUP(G28,INDIRECT(\"'\"&$K$1&\"'!$A$1:$H$550\"),8,FALSE))), \"Not Found\", (IF(ISNA(VLOOKUP(E28,INDIRECT(\"'\"&$K$1&\"'!$A$1:$H$550\"),8,FALSE)), VLOOKUP(G28,INDIRECT(\"'\"&$K$1&\"'!$A$1:$H$550\"),8,FALSE), VLOOKUP(E28,INDIRECT(\"'\"&$K$1&\"'!$A$1:$H$550\"),8,FALSE))))","v":"Not Found"},{"$f":"IF(AND(ISNA(VLOOKUP(E28,INDIRECT(\"'\"&$K$1&\"'!$A$1:$H$550\"),5,FALSE)), ISNA(VLOOKUP(G28,INDIRECT(\"'\"&$K$1&\"'!$A$1:$H$550\"),5,FALSE))), \"0\", (IF(ISNA(VLOOKUP(E28,INDIRECT(\"'\"&$K$1&\"'!$A$1:$H$550\"),5,FALSE)), VLOOKUP(G28,INDIRECT(\"'\"&$K$1&\"'!$A$1:$H$550\"),5,FALSE), VLOOKUP(E28,INDIRECT(\"'\"&$K$1&\"'!$A$1:$H$550\"),5,FALSE))))","v":"0"}]
["Mathematics"]
["MATH.1310","or","92.131",4,"MATH.1310","or","92.131",{"$f":"IF(AND(ISNA(VLOOKUP(E30,INDIRECT(\"'\"&$K$1&\"'!$A$1:$H$550\"),8,FALSE)), ISNA(VLOOKUP(G30,INDIRECT(\"'\"&$K$1&\"'!$A$1:$H$550\"),8,FALSE))), \"Not Found\", (IF(ISNA(VLOOKUP(E30,INDIRECT(\"'\"&$K$1&\"'!$A$1:$H$550\"),8,FALSE)), VLOOKUP(G30,INDIRECT(\"'\"&$K$1&\"'!$A$1:$H$550\"),8,FALSE), VLOOKUP(E30,INDIRECT(\"'\"&$K$1&\"'!$A$1:$H$550\"),8,FALSE))))","v":"Not Found"},{"$f":"IF(AND(ISNA(VLOOKUP(E30,INDIRECT(\"'\"&$K$1&\"'!$A$1:$H$550\"),5,FALSE)), ISNA(VLOOKUP(G30,INDIRECT(\"'\"&$K$1&\"'!$A$1:$H$550\"),5,FALSE))), \"0\", (IF(ISNA(VLOOKUP(E30,INDIRECT(\"'\"&$K$1&\"'!$A$1:$H$550\"),5,FALSE)), VLOOKUP(G30,INDIRECT(\"'\"&$K$1&\"'!$A$1:$H$550\"),5,FALSE), VLOOKUP(E30,INDIRECT(\"'\"&$K$1&\"'!$A$1:$H$550\"),5,FALSE))))","v":"0"}]
["MATH.1320","or","92.132",4,"MATH.1320","or","92.132","Not Found","0"]
["MATH.3210","or","92.321",3,"MATH.3210","or","92.321","Not Found","0"]
["MATH.3220","or","92.322",3,"MATH.3220","or","92.322","Not Found","0"]
["MATH.3860","or","92.386",3,"MATH.3860","or","92.386","Not Found","0"]
[]
["Natural Science Electives",null,null,null,null,null,null,null,null,null,null,"Natural Science Electives"]
["Requirement",null,null,"Credits","Taken",null,null,"Semester","Credits",null,null,"List courses you are interested in possibly taking to satisfy this requirement"]
["NS-1",null,null,3,{"$f":"IF(ISNA(INDEX(INDIRECT(\"'\"&$K$1&\"'!$A$1:$A$550\"), MATCH(A38,INDIRECT(\"'\"&$K$1&\"'!$C$1:$C$550\"),0))), \"Not Found\", (INDEX(INDIRECT(\"'\"&$K$1&\"'!$A$1:$A$550\"), MATCH(A38,INDIRECT(\"'\"&$K$1&\"'!$C$1:$C$550\"),0))))","v":"Not Found"},null,null,{"$f":"IF(ISNA(VLOOKUP(E38,INDIRECT(\"'\"&$K$1&\"'!$A$1:$H$550\"),8,FALSE)), \"Not Found\", VLOOKUP(E38,INDIRECT(\"'\"&$K$1&\"'!$A$1:$H$550\"),8,FALSE))","v":"Not Found"},{"$f":"IF(ISNA(VLOOKUP(E38,INDIRECT(\"'\"&$K$1&\"'!$A$1:$H$550\"),5,FALSE)), \"0\", VLOOKUP(E38,INDIRECT(\"'\"&$K$1&\"'!$A$1:$H$550\"),5,FALSE))","v":"0"},null,null,"Course","Title"]
["NS-Lab1",null,null,1,{"$f":"IF(ISNA(INDEX(INDIRECT(\"'\"&$K$1&\"'!$A$1:$A$550\"), MATCH(A39,INDIRECT(\"'\"&$K$1&\"'!$C$1:$C$550\"),0))), \"Not Found\", (INDEX(INDIRECT(\"'\"&$K$1&\"'!$A$1:$A$550\"), MATCH(A39,INDIRECT(\"'\"&$K$1&\"'!$C$1:$C$550\"),0))))","v":"Not Found"},null,null,"Not Found","0"]
["NS-2",null,null,3,"Not Found",null,null,"Not Found","0"]
["NS-Lab2",null,null,1,"Not Found",null,null,"Not Found","0"]
["NS-3",null,null,3,"Not Found",null,null,"Not Found","0"]
["NS-Lab3",null,null,1,"Not Found",null,null,"Not Found","0"]
["Not Req.",null,null,"n/a","Not Found",null,null,"Not Found","0"]
["Not Req.",null,null,"n/a","Not Found",null,null,"Not Found","0"]
[]
[]
[]
[]
[]
["Technical Electives",null,null,null,null,null,null,null,null,null,null,"Technical Electives"]
["Requirement",null,null,"Credits","Taken",null,null,"Semester","Credits",null,null,"List courses you are interested in possibly taking to satisfy this requirement"]
["TE-1",null,null,3,{"$f":"IF(ISNA(INDEX(INDIRECT(\"'\"&$K$1&\"'!$A$1:$A$550\"), MATCH(A53,INDIRECT(\"'\"&$K$1&\"'!$B$1:$B$550\"),0))), \"Not Found\", (INDEX(INDIRECT(\"'\"&$K$1&\"'!$A$1:$A$550\"), MATCH(A53,INDIRECT(\"'\"&$K$1&\"'!$B$1:$B$550\"),0))))","v":"Not Found"},null,null,{"$f":"IF(ISNA(VLOOKUP(E53,INDIRECT(\"'\"&$K$1&\"'!$A$1:$H$550\"),8,FALSE)), \"Not Found\", VLOOKUP(E53,INDIRECT(\"'\"&$K$1&\"'!$A$1:$H$550\"),8,FALSE))","v":"Not Found"},{"$f":"IF(ISNA(VLOOKUP(E53,INDIRECT(\"'\"&$K$1&\"'!$A$1:$H$550\"),5,FALSE)), \"0\", VLOOKUP(E53,INDIRECT(\"'\"&$K$1&\"'!$A$1:$H$550\"),5,FALSE))","v":"0"},null,null,"Course","Title"]
["TE-2",null,null,3,"Not Found",null,null,"Not Found","0"]
["Not Req.",null,null,"n/a","Not Found",null,null,"Not Found","0"]
["Not Req.",null,null,"n/a","Not Found",null,null,"Not Found","0"]
["Not Req.",null,null,"n/a","Not Found",null,null,"Not Found","0"]
[]
[]
[]
[]
[]
["Free Electives (FE)",null,null,null,null,null,null,null,null,null,null,"Free Electives"]
["Requirement",null,null,"Credits","Taken",null,null,"Semester","Credits",null,null,"List free electives you are interested in taking.  These cannot be below the level of a"]
["FE-1",null,null,3,{"$f":"IF(ISNA(INDEX(INDIRECT(\"'\"&$K$1&\"'!$A$1:$A$550\"), MATCH(\"*\"&A65&\"*\",INDIRECT(\"'\"&$K$1&\"'!$B$1:$B$550\"),0))), \"Not Found\", (INDEX(INDIRECT(\"'\"&$K$1&\"'!$A$1:$A$550\"), MATCH(\"*\"&A65&\"*\",INDIRECT(\"'\"&$K$1&\"'!$B$1:$B$550\"),0))))","v":"Not Found"},null,null,{"$f":"IF(ISNA(VLOOKUP(E65,INDIRECT(\"'\"&$K$1&\"'!$A$1:$H$550\"),8,FALSE)), \"Not Found\", VLOOKUP(E65,INDIRECT(\"'\"&$K$1&\"'!$A$1:$H$550\"),8,FALSE))","v":"Not Found"},{"$f":"IF(ISNA(VLOOKUP(E65,INDIRECT(\"'\"&$K$1&\"'!$A$1:$H$550\"),5,FALSE)), \"0\", VLOOKUP(E65,INDIRECT(\"'\"&$K$1&\"'!$A$1:$H$550\"),5,FALSE))","v":"0"},null,null,"required course.  Specific courses may be recommended for different CS tracks."]
["FE-2",null,null,3,"Not Found",null,null,"Not Found","0"]
["FE-3",null,null,3,"Not Found",null,null,"Not Found","0"]
["FE-4",null,null,3,"Not Found",null,null,"Not Found","0"]
["Not Req.",null,null,"n/a","Not Found",null,null,"Not Found","0"]
["Not Req.",null,null,"n/a","Not Found",null,null,"Not Found","0"]
[]
["Required FE Credits",null,null,null,null,null,null,"Projected Credits"]
[null,null,null,{"$f":"120-SUM(D4:D45, D53:D57, D86:D87,D91:D97)","v":12},null,null,null,null,{"$f":"SUM(I65:I71)","v":0}]
[]
["Oral & Written Communication"]
["Requirement",null,null,"Credits","Taken",null,null,"Semester","Credits"]
["ENGL.2200","or","42.220",3,"ENGL.2200","or","42.220",{"$f":"IF(AND(ISNA(VLOOKUP(E77,INDIRECT(\"'\"&$K$1&\"'!$A$1:$H$550\"),8,FALSE)), ISNA(VLOOKUP(G77,INDIRECT(\"'\"&$K$1&\"'!$A$1:$H$550\"),8,FALSE))), \"Not Found\", (IF(ISNA(VLOOKUP(E77,INDIRECT(\"'\"&$K$1&\"'!$A$1:$H$550\"),8,FALSE)), VLOOKUP(G77,INDIRECT(\"'\"&$K$1&\"'!$A$1:$H$550\"),8,FALSE), VLOOKUP(E77,INDIRECT(\"'\"&$K$1&\"'!$A$1:$H$550\"),8,FALSE))))","v":"Not Found"},{"$f":"IF(AND(ISNA(VLOOKUP(E77,INDIRECT(\"'\"&$K$1&\"'!$A$1:$H$550\"),5,FALSE)), ISNA(VLOOKUP(G77,INDIRECT(\"'\"&$K$1&\"'!$A$1:$H$550\"),5,FALSE))), \"0\", (IF(ISNA(VLOOKUP(E77,INDIRECT(\"'\"&$K$1&\"'!$A$1:$H$550\"),5,FALSE)), VLOOKUP(G77,INDIRECT(\"'\"&$K$1&\"'!$A$1:$H$550\"),5,FALSE), VLOOKUP(E77,INDIRECT(\"'\"&$K$1&\"'!$A$1:$H$550\"),5,FALSE))))","v":"0"}]
[]
["CS Ethics Requirement"]
["Requirement",null,null,"Credits","Taken",null,null,"Semester","Credits"]
["CSET",null,null,3,{"$f":"IF(ISNA(INDEX(INDIRECT(\"'\"&$K$1&\"'!$A$1:$A$550\"), MATCH(A81,INDIRECT(\"'\"&$K$1&\"'!$C$1:$C$550\"),0))), \"Not Found\", (INDEX(INDIRECT(\"'\"&$K$1&\"'!$A$1:$A$550\"), MATCH(A81,INDIRECT(\"'\"&$K$1&\"'!$C$1:$C$550\"),0))))","v":"Not Found"},null,null,{"$f":"IF(ISNA(VLOOKUP(E81,INDIRECT(\"'\"&$K$1&\"'!$A$1:$H$550\"),8,FALSE)), \"Not Found\", VLOOKUP(E81,INDIRECT(\"'\"&$K$1&\"'!$A$1:$H$550\"),8,FALSE))","v":"Not Found"},{"$f":"IF(ISNA(VLOOKUP(E81,INDIRECT(\"'\"&$K$1&\"'!$A$1:$H$550\"),5,FALSE)), \"0\", VLOOKUP(E81,INDIRECT(\"'\"&$K$1&\"'!$A$1:$H$550\"),5,FALSE))","v":"0"}]
[]
["Breadth of Knowledge",null,null,null,null,null,null,null,null,null,null," Breadth of Knowledge Requirements"]
["Requirement",null,null,"Credits","Taken",null,null,"Semester","Credits",null,null,"Select courses you are interested in taking to satisfy this Requirements."]
["College Writing",null,null,null,null,null,null,null,null,null,null,"Area","Title"]
["CW-1",null,null,3,{"$f":"IF(ISNA(INDEX(INDIRECT(\"'\"&$K$1&\"'!$A$1:$A$550\"), MATCH(A86,INDIRECT(\"'\"&$K$1&\"'!$B$1:$B$550\"),0))), \"Not Found\", (INDEX(INDIRECT(\"'\"&$K$1&\"'!$A$1:$A$550\"), MATCH(A86,INDIRECT(\"'\"&$K$1&\"'!$B$1:$B$550\"),0))))","v":"Not Found"},null,null,{"$f":"IF(ISNA(VLOOKUP(E86,INDIRECT(\"'\"&$K$1&\"'!$A$1:$H$550\"),8,FALSE)), \"Not Found\", VLOOKUP(E86,INDIRECT(\"'\"&$K$1&\"'!$A$1:$H$550\"),8,FALSE))","v":"Not Found"},{"$f":"IF(ISNA(VLOOKUP(E86,INDIRECT(\"'\"&$K$1&\"'!$A$1:$H$550\"),5,FALSE)), \"0\", VLOOKUP(E86,INDIRECT(\"'\"&$K$1&\"'!$A$1:$H$550\"),5,FALSE))","v":"0"}]
["CW-2",null,null,3,"Not Found",null,null,"Not Found","0"]
["Mathematics"]
["MA",null,null,4,{"$f":"IF(ISNA(INDEX(INDIRECT(\"'\"&$K$1&\"'!$A$1:$A$550\"), MATCH(A89,INDIRECT(\"'\"&$K$1&\"'!$B$1:$B$550\"),0))), \"Not Found\", (INDEX(INDIRECT(\"'\"&$K$1&\"'!$A$1:$A$550\"), MATCH(A89,INDIRECT(\"'\"&$K$1&\"'!$B$1:$B$550\"),0))))","v":"Not Found"},null,null,{"$f":"IF(ISNA(VLOOKUP(E89,INDIRECT(\"'\"&$K$1&\"'!$A$1:$H$550\"),8,FALSE)), \"Not Found\", VLOOKUP(E89,INDIRECT(\"'\"&$K$1&\"'!$A$1:$H$550\"),8,FALSE))","v":"Not Found"},{"$f":"IF(ISNA(VLOOKUP(E89,INDIRECT(\"'\"&$K$1&\"'!$A$1:$H$550\"),5,FALSE)), \"0\", VLOOKUP(E89,INDIRECT(\"'\"&$K$1&\"'!$A$1:$H$550\"),5,FALSE))","v":"0"}]
["Arts & Humanities"]
["AH-1",null,null,3,{"$f":"IF(ISNA(INDEX(INDIRECT(\"'\"&$K$1&\"'!$A$1:$A$550\"), MATCH(\"*\"&A91&\"*\",INDIRECT(\"'\"&$K$1&\"'!$B$1:$B$550\"),0))), \"Not Found\", (INDEX(INDIRECT(\"'\"&$K$1&\"'!$A$1:$A$550\"), MATCH(\"*\"&A91&\"*\",INDIRECT(\"'\"&$K$1&\"'!$B$1:$B$550\"),0))))","v":"Not Found"},null,null,{"$f":"IF(ISNA(VLOOKUP(E91,INDIRECT(\"'\"&$K$1&\"'!$A$1:$H$550\"),8,FALSE)), \"Not Found\", VLOOKUP(E91,INDIRECT(\"'\"&$K$1&\"'!$A$1:$H$550\"),8,FALSE))","v":"Not Found"},{"$f":"IF(ISNA(VLOOKUP(E91,INDIRECT(\"'\"&$K$1&\"'!$A$1:$H$550\"),5,FALSE)), \"0\", VLOOKUP(E91,INDIRECT(\"'\"&$K$1&\"'!$A$1:$H$550\"),5,FALSE))","v":"0"}]
["AH-2",null,null,3,{"$f":"IF(ISNA(INDEX(INDIRECT(\"'\"&$K$1&\"'!$A$1:$A$550\"), MATCH(\"*\"&A92&\"*\",INDIRECT(\"'\"&$K$1&\"'!$B$1:$B$550\"),0))), \"Not Found\", (INDEX(INDIRECT(\"'\"&$K$1&\"'!$A$1:$A$550\"), MATCH(\"*\"&A92&\"*\",INDIRECT(\"'\"&$K$1&\"'!$B$1:$B$550\"),0))))","v":"Not Found"},null,null,"Not Found","0"]
["AH-3",null,null,3,"Not Found",null,null,"Not Found","0"]
["Social Sciences"]
["SS-1",null,null,3,{"$f":"IF(ISNA(INDEX(INDIRECT(\"'\"&$K$1&\"'!$A$1:$A$550\"), MATCH(\"*\"&A95&\"*\",INDIRECT(\"'\"&$K$1&\"'!$B$1:$B$550\"),0))), \"Not Found\", (INDEX(INDIRECT(\"'\"&$K$1&\"'!$A$1:$A$550\"), MATCH(\"*\"&A95&\"*\",INDIRECT(\"'\"&$K$1&\"'!$B$1:$B$550\"),0))))","v":"Not Found"},null,null,{"$f":"IF(ISNA(VLOOKUP(E95,INDIRECT(\"'\"&$K$1&\"'!$A$1:$H$550\"),8,FALSE)), \"Not Found\", VLOOKUP(E95,INDIRECT(\"'\"&$K$1&\"'!$A$1:$H$550\"),8,FALSE))","v":"Not Found"},{"$f":"IF(ISNA(VLOOKUP(E95,INDIRECT(\"'\"&$K$1&\"'!$A$1:$H$550\"),5,FALSE)), \"0\", VLOOKUP(E95,INDIRECT(\"'\"&$K$1&\"'!$A$1:$H$550\"),5,FALSE))","v":"0"}]
["SS-2",null,null,3,"Not Found",null,null,"Not Found","0"]
["SS-3",null,null,3,"Not Found",null,null,"Not Found","0"]
["Sciences with Lab"]
["SC-1",null,null,3,{"$f":"IF(ISNA(INDEX(INDIRECT(\"'\"&$K$1&\"'!$A$1:$A$550\"), MATCH(A99,INDIRECT(\"'\"&$K$1&\"'!$B$1:$B$550\"),0))), \"Not Found\", (INDEX(INDIRECT(\"'\"&$K$1&\"'!$A$1:$A$550\"), MATCH(A99,INDIRECT(\"'\"&$K$1&\"'!$B$1:$B$550\"),0))))","v":"Not Found"},null,null,{"$f":"IF(ISNA(VLOOKUP(E99,INDIRECT(\"'\"&$K$1&\"'!$A$1:$H$550\"),8,FALSE)), \"Not Found\", VLOOKUP(E99,INDIRECT(\"'\"&$K$1&\"'!$A$1:$H$550\"),8,FALSE))","v":"Not Found"},{"$f":"IF(ISNA(VLOOKUP(E99,INDIRECT(\"'\"&$K$1&\"'!$A$1:$H$550\"),5,FALSE)), \"0\", VLOOKUP(E99,INDIRECT(\"'\"&$K$1&\"'!$A$1:$H$550\"),5,FALSE))","v":"0"}]
["SCL-1",null,null,1,"Not Found",null,null,"Not Found","0"]
["SC-2",null,null,3,"Not Found",null,null,"Not Found","0"]
["SCL-2",null,null,1,"Not Found",null,null,"Not Found","0"]
["STEM"]
["STEM",null,null,3,{"$f":"IF(ISNA(INDEX(INDIRECT(\"'\"&$K$1&\"'!$A$1:$A$550\"), MATCH(A104,INDIRECT(\"'\"&$K$1&\"'!$B$1:$B$550\"),0))), \"Not Found\", (INDEX(INDIRECT(\"'\"&$K$1&\"'!$A$1:$A$550\"), MATCH(A104,INDIRECT(\"'\"&$K$1&\"'!$B$1:$B$550\"),0))))","v":"Not Found"},null,null,{"$f":"IF(ISNA(VLOOKUP(E104,INDIRECT(\"'\"&$K$1&\"'!$A$1:$H$550\"),8,FALSE)), \"Not Found\", VLOOKUP(E104,INDIRECT(\"'\"&$K$1&\"'!$A$1:$H$550\"),8,FALSE))","v":"Not Found"},{"$f":"IF(ISNA(VLOOKUP(E104,INDIRECT(\"'\"&$K$1&\"'!$A$1:$H$550\"),5,FALSE)), \"0\", VLOOKUP(E104,INDIRECT(\"'\"&$K$1&\"'!$A$1:$H$550\"),5,FALSE))","v":"0"}]
[]
["Diversity & Ethics ELOs"]
["Diversity & Cultural Awareness (DV)"]
["DV",null,null,3,{"$f":"IF(ISNA(INDEX(INDIRECT(\"'\"&$K$1&\"'!$A$1:$A$550\"), MATCH(\"*\"&A108&\"*\",INDIRECT(\"'\"&$K$1&\"'!$B$1:$B$550\"),0))), \"Not Found\", (INDEX(INDIRECT(\"'\"&$K$1&\"'!$A$1:$A$550\"), MATCH(\"*\"&A108&\"*\",INDIRECT(\"'\"&$K$1&\"'!$B$1:$B$550\"),0))))","v":"Not Found"},null,null,{"$f":"IF(ISNA(VLOOKUP(E108,INDIRECT(\"'\"&$K$1&\"'!$A$1:$H$550\"),8,FALSE)), \"Not Found\", VLOOKUP(E108,INDIRECT(\"'\"&$K$1&\"'!$A$1:$H$550\"),8,FALSE))","v":"Not Found"},{"$f":"IF(ISNA(VLOOKUP(E108,INDIRECT(\"'\"&$K$1&\"'!$A$1:$H$550\"),5,FALSE)), \"0\", VLOOKUP(E108,INDIRECT(\"'\"&$K$1&\"'!$A$1:$H$550\"),5,FALSE))","v":"0"}]
["Social Responsibility & Ethics (ET)"]
["ET",null,null,3,{"$f":"IF(ISNA(INDEX(INDIRECT(\"'\"&$K$1&\"'!$A$1:$A$550\"), MATCH(\"*\"&A110&\"*\",INDIRECT(\"'\"&$K$1&\"'!$B$1:$B$550\"),0))), \"Not Found\", (INDEX(INDIRECT(\"'\"&$K$1&\"'!$A$1:$A$550\"), MATCH(\"*\"&A110&\"*\",INDIRECT(\"'\"&$K$1&\"'!$B$1:$B$550\"),0))))","v":"Not Found"},null,null,{"$f":"IF(ISNA(VLOOKUP(E110,INDIRECT(\"'\"&$K$1&\"'!$A$1:$H$550\"),8,FALSE)), \"Not Found\", VLOOKUP(E110,INDIRECT(\"'\"&$K$1&\"'!$A$1:$H$550\"),8,FALSE))","v":"Not Found"},{"$f":"IF(ISNA(VLOOKUP(E110,INDIRECT(\"'\"&$K$1&\"'!$A$1:$H$550\"),5,FALSE)), \"0\", VLOOKUP(E110,INDIRECT(\"'\"&$K$1&\"'!$A$1:$H$550\"),5,FALSE))","v":"0"}]
[]
["Degree Credits",null,null,null,null,null,null,null,"Projected Degree Credits "]
[null,null,null,{"$f":"SUM(D1:D45,D53:D70,D86,D87,D91:D97)","v":120},null,null,null,null,{"$f":"SUM(I1:I45, I53:I57,I73,I86,I87,I91:I97)","v":0}]

{"sheet":"Graduation_Plan-Data-Science","index":11,"n_rows":399,"n_cols":8,"rows_kept":399,"cut":false,"hidden":true,"merged":[[3,0,3,1],[3,2,3,5],[0,0,0,5],[1,0,1,1],[1,2,1,5],[2,0,2,1],[2,2,2,5],[4,0,4,1],[4,2,4,5],[5,0,5,1],[5,2,5,5],[6,0,6,1],[6,2,6,5],[13,0,13,6],[7,0,7,1],[7,2,7,5],[8,0,8,1],[8,2,8,5],[9,0,9,1],[9,2,9,5],[10,0,10,6],[11,0,11,3],[11,4,11,5],[12,0,12,3],[12,4,12,5],[96,2,96,5],[14,0,14,3],[15,0,15,6],[16,0,16,5],[17,0,17,5],[69,0,69,2],[70,0,70,2],[71,0,71,6],[72,0,72,5],[73,2,73,5],[87,0,87,6],[88,2,88,5],[172,0,172,5],[110,0,110,6],[111,2,111,5],[121,0,121,6],[122,0,122,5],[123,2,123,5],[137,0,137,6],[138,2,138,5],[146,2,146,5],[160,0,160,6],[161,2,161,5],[171,0,171,6],[246,2,246,5],[173,2,173,6],[187,0,187,6],[188,2,188,5],[196,2,196,5],[210,0,210,6],[211,2,211,5],[221,0,221,6],[222,0,222,5],[223,2,223,5],[237,0,237,6],[238,2,238,5],[322,0,322,5],[260,0,260,6],[261,2,261,5],[271,0,271,6],[272,0,272,5],[273,2,273,5],[287,0,287,6],[288,2,288,5],[296,2,296,5],[310,0,310,6],[311,2,311,5],[321,0,321,6],[379,1,380,3],[379,4,380,4],[323,2,323,5],[337,0,337,6],[338,2,338,5],[346,2,346,5],[360,0,360,6],[361,2,361,5],[371,0,371,6],[373,1,373,4],[375,1,376,3],[375,4,376,4],[377,1,377,3],[399,1,399,4],[381,1,381,3],[383,1,384,3],[383,4,384,4],[385,1,385,3],[387,1,388,3],[387,4,388,4],[389,1,389,3],[391,1,392,3],[391,4,392,4],[393,1,393,3],[398,1,398,4]]}
["Computer Science Graduation Plan"]
["Student Name",null,"Last Name, First Name"]
["University Id (not ss#)"]
["Email"]
["Primary Major (Option)",null,"Computer Science (Data Science)"]
["Second Major:"]
["Third Major:"]
["Minors(s):"]
["Special Program(s):"]
["Scholarships:"]
[]
["Matriculation Date (Month/Year)",null,null,null,"Sept. 2016"]
["Expected Graduation Date (Month/Year)",null,null,null,"June 2020"]
[]
["Minimum Number of Credits Required for Degree(s)",null,null,null,120]
[]
["Transfer and AP Credits"]
[]
["Course","Req.","Req.","Course Title","Credits","Grade","Degree Credits","SemesterYear"]
[null,null,null,null,null,null,null,"Transfer/AP"]
[null,null,null,null,null,null,null,"Transfer/AP"]
[null,null,null,null,null,null,null,"Transfer/AP"]
[null,null,null,null,null,null,null,"Transfer/AP"]
[null,null,null,null,null,null,null,"Transfer/AP"]
[null,null,null,null,null,null,null,"Transfer/AP"]
[null,null,null,null,null,null,null,"Transfer/AP"]
[null,null,null,null,null,null,null,"Transfer/AP"]
[null,null,null,null,null,null,null,"Transfer/AP"]
[null,null,null,null,null,null,null,"Transfer/AP"]
[null,null,null,null,null,null,null,"Transfer/AP"]
[null,null,null,null,null,null,null,"Transfer/AP"]
[null,null,null,null,null,null,null,"Transfer/AP"]
[null,null,null,null,null,null,null,"Transfer/AP"]
[null,null,null,null,null,null,null,"Transfer/AP"]
[null,null,null,null,null,null,null,"Transfer/AP"]
[null,null,null,null,null,null,null,"Transfer/AP"]
[null,null,null,null,null,null,null,"Transfer/AP"]
[null,null,null,null,null,null,null,"Transfer/AP"]
[null,null,null,null,null,null,null,"Transfer/AP"]
[null,null,null,null,null,null,null,"Transfer/AP"]
[null,null,null,null,null,null,null,"Transfer/AP"]
[null,null,null,null,null,null,null,"Transfer/AP"]
[null,null,null,null,null,null,null,"Transfer/AP"]
[null,null,null,null,null,null,null,"Transfer/AP"]
[null,null,null,null,null,null,null,"Transfer/AP"]
[null,null,null,null,null,null,null,"Transfer/AP"]
[null,null,null,null,null,null,null,"Transfer/AP"]
[null,null,null,null,null,null,null,"Transfer/AP"]
[null,null,null,null,null,null,null,"Transfer/AP"]
[null,null,null,null,null,null,null,"Transfer/AP"]
[null,null,null,null,null,null,null,"Transfer/AP"]
[null,null,null,null,null,null,null,"Transfer/AP"]
[null,null,null,null,null,null,null,"Transfer/AP"]
[null,null,null,null,null,null,null,"Transfer/AP"]
[null,null,null,null,null,null,null,"Transfer/AP"]
[null,null,null,null,null,null,null,"Transfer/AP"]
[null,null,null,null,null,null,null,"Transfer/AP"]
[null,null,null,null,null,null,null,"Transfer/AP"]
[null,null,null,null,null,null,null,"Transfer/AP"]
[null,null,null,null,null,null,null,"Transfer/AP"]
[null,null,null,null,null,null,null,"Transfer/AP"]
[null,null,null,null,null,null,null,"Transfer/AP"]
[null,null,null,null,null,null,null,"Transfer/AP"]
[null,null,null,null,null,null,null,"Transfer/AP"]
[null,null,null,null,null,null,null,"Transfer/AP"]
[null,null,null,null,null,null,null,"Transfer/AP"]
[null,null,null,null,null,null,null,"Transfer/AP"]
[null,null,null,null,null,null,null,"Transfer/AP"]
[null,null,null,null,null,null,null,"Transfer/AP"]
[" "," ",null,"Transfer and AP Credits",{"$f":"SUM(E20:E69)","v":0},null,{"$f":"SUM(G20:G69)","v":0}]
[" "," ",null,"Total Credits Earned",{"$f":"E70","v":0},null,{"$f":"E15-G70","v":120}]
[]
["Year 1"]
["Fall","2015",{"$f":"C2","v":"Last Name, First Name"}]
["Course",{"$f":"B19","v":"Req."},{"$f":"C19","v":"Req."},"Course Title","Credits","Grade","Degree Credits","SemesterYear"]
[null,null,null,null,null,null,null,{"$f":"$A$74&$B$74","v":"Fall2015"}]
[null,null,null,null,null,null,null,{"$f":"$A$74&$B$74","v":"Fall2015"}]
[null,null,null,null,null,null,null,"Fall2015"]
[null,null,null,null,null,null,null,"Fall2015"]
[null,null,null,null,null,null,null,"Fall2015"]
[null,null,null,null,null,null,null,"Fall2015"]
[null,null,null,null,null,null,null,"Fall2015"]
[null,null,null,null,null,null,null,"Fall2015"]
[null,null,null,null,null,null,null,"Fall2015"]
[null,null,null,null,null,null,null,"Fall2015"]
[" "," ",null,"Semester Credits Earned",{"$f":"SUM(E76:E85)","v":0},null,{"$f":"SUM(G76:G85)","v":0}]
[" "," ",null,{"$f":"D71","v":"Total Credits Earned"},{"$f":"E71+E86","v":0},null,{"$f":"G71-G86","v":120}]
[]
["Winter",{"$f":"B74+1","v":2016},{"$f":"C2","v":"Last Name, First Name"}]
["Course",{"$f":"B19","v":"Req."},null,"Course Title","Credits","Grade","Degree Credits","SemesterYear"]
[null,null,null,null,null,null,null,{"$f":"$A$89&$B$89","v":"Winter2016"}]
[null,null,null,null,null,null,null,{"$f":"$A$89&$B$89","v":"Winter2016"}]
[null,null,null,null,null,null,null,"Winter2016"]
[" "," ",null,{"$f":"D86","v":"Semester Credits Earned"},{"$f":"SUM(E91:E93)","v":0},null,{"$f":"SUM(G91:G93)","v":0}]
[" "," ",null,{"$f":"D71","v":"Total Credits Earned"},{"$f":"E87+E94","v":0},null,{"$f":"G87-G94","v":120}]
[]
["Spring",{"$f":"B74+1","v":2016},{"$f":"C2","v":"Last Name, First Name"}]
["Course",{"$f":"B19","v":"Req."},{"$f":"C19","v":"Req."},"Course Title","Credits","Grade","Degree Credits","SemesterYear"]
[null,null,null,null,null,null,null,{"$f":"$A$97&$B$97","v":"Spring2016"}]
[null,null,null,null,null,null,null,{"$f":"$A$97&$B$97","v":"Spring2016"}]
[null,null,null,null,null,null,null,"Spring2016"]
[null,null,null,null,null,null,null,"Spring2016"]
[null,null,null,null,null,null,null,"Spring2016"]
[null,null,null,null,null,null,null,"Spring2016"]
[null,null,null,null,null,null,null,"Spring2016"]
[null,null,null,null,null,null,null,"Spring2016"]
[null,null,null,null,null,null,null,"Spring2016"]
[null,null,null,null,null,null,null,"Spring2016"]
[" "," ",null,{"$f":"D86","v":"Semester Credits Earned"},{"$f":"SUM(E99:E108)","v":0},null,{"$f":"SUM(G99:G108)","v":0}]
[" "," ",null,{"$f":"D71","v":"Total Credits Earned"},{"$f":"E95+E109","v":0},null,{"$f":"G95-G109","v":120}]
[]
["Summer",{"$f":"B74+1","v":2016},{"$f":"C2","v":"Last Name, First Name"}]
["Course",{"$f":"B19","v":"Req."},{"$f":"C19","v":"Req."},"Course Title","Credits","Grade","Degree Credits","SemesterYear"]
[null,null,null,null,null,null,null,{"$f":"$A$112&$B$112","v":"Summer2016"}]
[null,null,null,null,null,null,null,{"$f":"$A$112&$B$112","v":"Summer2016"}]
[null,null,null,null,null,null,null,"Summer2016"]
[null,null,null,null,null,null,null,"Summer2016"]
[null,null,null,null,null,null,null,"Summer2016"]
[null,null,null,null,null,null,null,"Summer2016"]
[" "," ",null,{"$f":"D86","v":"Semester Credits Earned"},{"$f":"SUM(E114:E119)","v":0},null,{"$f":"SUM(G114:G119)","v":0}]
[" "," ",null,{"$f":"D71","v":"Total Credits Earned"},{"$f":"E110+E120","v":0},null,{"$f":"G110-G120","v":120}]
[]
["Year 2"]
["Fall",{"$f":"B74+1","v":2016},{"$f":"C2","v":"Last Name, First Name"}]
["Course",{"$f":"B19","v":"Req."},{"$f":"C19","v":"Req."},"Course Title","Credits","Grade","Degree Credits","SemesterYear"]
[null,null,null,null,null,null,null,{"$f":"$A$124&$B$124","v":"Fall2016"}]
[null,null,null,null,null,null,null,{"$f":"$A$124&$B$124","v":"Fall2016"}]
[null,null,null,null,null,null,null,"Fall2016"]
[null,null,null,null,null,null,null,"Fall2016"]
[null,null,null,null,null,null,null,"Fall2016"]
[null,null,null,null,null,null,null,"Fall2016"]
[null,null,null,null,null,null,null,"Fall2016"]
[null,null,null,null,null,null,null,"Fall2016"]
[null,null,null,null,null,null,null,"Fall2016"]
[null,null,null,null,null,null,null,"Fall2016"]
[" "," ",null,{"$f":"D86","v":"Semester Credits Earned"},{"$f":"SUM(E126:E135)","v":0},null,{"$f":"SUM(G126:G135)","v":0}]
[" "," ",null,{"$f":"D71","v":"Total Credits Earned"},{"$f":"E121+E136","v":0},null,{"$f":"G121-G136","v":120}]
[]
["Winter",{"$f":"B74+2","v":2017},{"$f":"C2","v":"Last Name, First Name"}]
["Course",{"$f":"B19","v":"Req."},{"$f":"C19","v":"Req."},"Course Title","Credits","Grade","Degree Credits","SemesterYear"]
[null,null,null,null,null,null,null,{"$f":"$A$139&$B$139","v":"Winter2017"}]
[null,null,null,null,null,null,null,{"$f":"$A$139&$B$139","v":"Winter2017"}]
[null,null,null,null,null,null,null,"Winter2017"]
[" "," ",null,{"$f":"D86","v":"Semester Credits Earned"},{"$f":"SUM(E141:E143)","v":0},null,{"$f":"SUM(G141:G143)","v":0}]
[" "," ",null,{"$f":"D71","v":"Total Credits Earned"},{"$f":"E137+E144","v":0},null,{"$f":"G137-G144","v":120}]
[]
["Spring",{"$f":"B89+1","v":2017},{"$f":"C2","v":"Last Name, First Name"}]
["Course",{"$f":"B19","v":"Req."},{"$f":"C19","v":"Req."},"Course Title","Credits","Grade","Degree Credits","SemesterYear"]
[null,null,null,null,null,null,null,{"$f":"$A$147&$B$147","v":"Spring2017"}]
[null,null,null,null,null,null,null,{"$f":"$A$147&$B$147","v":"Spring2017"}]
[null,null,null,null,null,null,null,"Spring2017"]
[null,null,null,null,null,null,null,"Spring2017"]
[null,null,null,null,null,null,null,"Spring2017"]
[null,null,null,null,null,null,null,"Spring2017"]
[null,null,null,null,null,null,null,"Spring2017"]
[null,null,null,null,null,null,null,"Spring2017"]
[null,null,null,null,null,null,null,"Spring2017"]
[null,null,null,null,null,null,null,"Spring2017"]
[" "," ",null,{"$f":"D86","v":"Semester Credits Earned"},{"$f":"SUM(E149:E158)","v":0},null,{"$f":"SUM(G149:G158)","v":0}]
[" "," ",null,{"$f":"D71","v":"Total Credits Earned"},{"$f":"E145+E159","v":0},null,{"$f":"G145-G159","v":120}]
[]
["Summer",{"$f":"B74+2","v":2017},{"$f":"C2","v":"Last Name, First Name"}]
["Course",{"$f":"B19","v":"Req."},{"$f":"C19","v":"Req."},"Course Title","Credits","Grade","Degree Credits","SemesterYear"]
[null,null,null,null,null,null,null,{"$f":"$A$162&$B$162","v":"Summer2017"}]
[null,null,null,null,null,null,null,{"$f":"$A$162&$B$162","v":"Summer2017"}]
[null,null,null,null,null,null,null,"Summer2017"]
[null,null,null,null,null,null,null,"Summer2017"]
[null,null,null,null,null,null,null,"Summer2017"]
[null,null,null,null,null,null,null,"Summer2017"]
[" "," ",null,{"$f":"D86","v":"Semester Credits Earned"},{"$f":"SUM(E164:E169)","v":0},null,{"$f":"SUM(G163:G169)","v":0}]
[" "," ",null,{"$f":"D71","v":"Total Credits Earned"},{"$f":"E160+E170","v":0},null,{"$f":"G160-G170","v":120}]
[]
["Year 3"]
["Fall",{"$f":"B74+2","v":2017},{"$f":"C2","v":"Last Name, First Name"}]
["Course",{"$f":"B19","v":"Req."},{"$f":"C19","v":"Req."},"Course Title","Credits","Grade","Degree Credits","SemesterYear"]
[null,null,null,null,null,null,null,{"$f":"$A$174&$B$174","v":"Fall2017"}]
[null,null,null,null,null,null,null,{"$f":"$A$174&$B$174","v":"Fall2017"}]
[null,null,null,null,null,null,null,"Fall2017"]
[null,null,null,null,null,null,null,"Fall2017"]
[null,null,null,null,null,null,null,"Fall2017"]
[null,null,null,null,null,null,null,"Fall2017"]
[null,null,null,null,null,null,null,"Fall2017"]
[null,null,null,null,null,null,null,"Fall2017"]
[null,null,null,null,null,null,null,"Fall2017"]
[null,null,null,null,null,null,null,"Fall2017"]
[" "," ",null,{"$f":"D86","v":"Semester Credits Earned"},{"$f":"SUM(E176:E185)","v":0},null,{"$f":"SUM(G176:G185)","v":0}]
[" "," ",null,{"$f":"D71","v":"Total Credits Earned"},{"$f":"E171+E186","v":0},null,{"$f":"G171-G186","v":120}]
[]
["Winter",{"$f":"B74+3","v":2018},{"$f":"C2","v":"Last Name, First Name"}]
["Course",{"$f":"B19","v":"Req."},{"$f":"C19","v":"Req."},"Course Title","Credits","Grade","Degree Credits","SemesterYear"]
[null,null,null,null,null,null,null,{"$f":"$A$189&$B$189","v":"Winter2018"}]
[null,null,null,null,null,null,null,{"$f":"$A$189&$B$189","v":"Winter2018"}]
[null,null,null,null,null,null,null,"Winter2018"]
[" "," ",null,{"$f":"D86","v":"Semester Credits Earned"},{"$f":"SUM(E191:E193)","v":0},null,{"$f":"SUM(G191:G193)","v":0},{"$f":"SUM(H191:H193)","v":0}]
[" "," ",null,{"$f":"D71","v":"Total Credits Earned"},{"$f":"E187+E194","v":0},null,{"$f":"G187-G194","v":120}]
[]
["Spring",{"$f":"B74+3","v":2018},{"$f":"C2","v":"Last Name, First Name"}]
["Course",{"$f":"B19","v":"Req."},{"$f":"C19","v":"Req."},"Course Title","Credits","Grade","Degree Credits","SemesterYear"]
[null,null,null,null,null,null,null,{"$f":"$A$197&$B$197","v":"Spring2018"}]
[null,null,null,null,null,null,null,{"$f":"$A$197&$B$197","v":"Spring2018"}]
[null,null,null,null,null,null,null,"Spring2018"]
[null,null,null,null,null,null,null,"Spring2018"]
[null,null,null,null,null,null,null,"Spring2018"]
[null,null,null,null,null,null,null,"Spring2018"]
[null,null,null,null,null,null,null,"Spring2018"]
[null,null,null,null,null,null,null,"Spring2018"]
[null,null,null,null,null,null,null,"Spring2018"]
[null,null,null,null,null,null,null,"Spring2018"]
[" "," ",null,{"$f":"D86","v":"Semester Credits Earned"},{"$f":"SUM(E199:E208)","v":0},null,{"$f":"SUM(G199:G208)","v":0}]
[" "," ",null,{"$f":"D71","v":"Total Credits Earned"},{"$f":"E195+E209","v":0},null,{"$f":"G195-G209","v":120}]
[]
["Summer",{"$f":"B74+3","v":2018},{"$f":"C2","v":"Last Name, First Name"}]
["Course",{"$f":"B19","v":"Req."},{"$f":"C19","v":"Req."},"Course Title","Credits","Grade","Degree Credits","SemesterYear"]
[null,null,null,null,null,null,null,{"$f":"$A$212&$B$212","v":"Summer2018"}]
[null,null,null,null,null,null,null,{"$f":"$A$212&$B$212","v":"Summer2018"}]
[null,null,null,null,null,null,null,"Summer2018"]
[null,null,null,null,null,null,null,"Summer2018"]
[null,null,null,null,null,null,null,"Summer2018"]
[null,null,null,null,null,null,null,"Summer2018"]
[" "," ",null,{"$f":"D86","v":"Semester Credits Earned"},{"$f":"SUM(E214:E219)","v":0},null,{"$f":"SUM(G213:G219)","v":0}]
[" "," ",null,{"$f":"D71","v":"Total Credits Earned"},{"$f":"E210+E220","v":0},null,{"$f":"G210-G220","v":120}]
[]
["Year 4"]
["Fall",{"$f":"B74+3","v":2018},{"$f":"C2","v":"Last Name, First Name"}]
["Course",{"$f":"B19","v":"Req."},{"$f":"C19","v":"Req."},"Course Title","Credits","Grade","Degree Credits","SemesterYear"]
[null,null,null,null,null,null,null,{"$f":"$A$224&$B$224","v":"Fall2018"}]
[null,null,null,null,null,null,null,{"$f":"$A$224&$B$224","v":"Fall2018"}]
[null,null,null,null,null,null,null,"Fall2018"]
[null,null,null,null,null,null,null,"Fall2018"]
[null,null,null,null,null,null,null,"Fall2018"]
[null,null,null,null,null,null,null,"Fall2018"]
[null,null,null,null,null,null,null,"Fall2018"]
[null,null,null,null,null,null,null,"Fall2018"]
[null,null,null,null,null,null,null,"Fall2018"]
[null,null,null,null,null,null,null,"Fall2018"]
[" "," ",null,{"$f":"D86","v":"Semester Credits Earned"},{"$f":"SUM(E226:E235)","v":0},null,{"$f":"SUM(G226:G235)","v":0}]
[" "," ",null,{"$f":"D71","v":"Total Credits Earned"},{"$f":"E221+E236","v":0},null,{"$f":"G221-G236","v":120}]
[]
["Winter",{"$f":"B74+4","v":2019},{"$f":"C2","v":"Last Name, First Name"}]
["Course",{"$f":"B19","v":"Req."},{"$f":"C19","v":"Req."},"Course Title","Credits","Grade","Degree Credits","SemesterYear"]
[null,null,null,null,null,null,null,{"$f":"$A$239&$B$239","v":"Winter2019"}]
[null,null,null,null,null,null,null,{"$f":"$A$239&$B$239","v":"Winter2019"}]
[null,null,null,null,null,null,null,"Winter2019"]
[" "," ",null,{"$f":"D86","v":"Semester Credits Earned"},{"$f":"SUM(E241:E243)","v":0},null,{"$f":"SUM(G241:G243)","v":0}]
[" "," ",null,{"$f":"D71","v":"Total Credits Earned"},{"$f":"E237+E244","v":0},null,{"$f":"G237-G244","v":120}]
[]
["Spring",{"$f":"B74+4","v":2019},{"$f":"C2","v":"Last Name, First Name"}]
["Course",{"$f":"B19","v":"Req."},{"$f":"C19","v":"Req."},"Course Title","Credits","Grade","Degree Credits","SemesterYear"]
[null,null,null,null,null,null,null,{"$f":"$A$247&$B$247","v":"Spring2019"}]
[null,null,null,null,null,null,null,{"$f":"$A$247&$B$247","v":"Spring2019"}]
[null,null,null,null,null,null,null,"Spring2019"]
[null,null,null,null,null,null,null,"Spring2019"]
[null,null,null,null,null,null,null,"Spring2019"]
[null,null,null,null,null,null,null,"Spring2019"]
[null,null,null,null,null,null,null,"Spring2019"]
[null,null,null,null,null,null,null,"Spring2019"]
[null,null,null,null,null,null,null,"Spring2019"]
[null,null,null,null,null,null,null,"Spring2019"]
[" "," ",null,{"$f":"D86","v":"Semester Credits Earned"},{"$f":"SUM(E249:E258)","v":0},null,{"$f":"SUM(G249:G258)","v":0}]
[" "," ",null,{"$f":"D71","v":"Total Credits Earned"},{"$f":"E245+E259","v":0},null,{"$f":"G245-G259","v":120}]
[]
["Summer",{"$f":"B74+4","v":2019},{"$f":"C2","v":"Last Name, First Name"}]
["Course",{"$f":"B19","v":"Req."},{"$f":"C19","v":"Req."},"Course Title","Credits","Grade","Degree Credits","SemesterYear"]
[null,null,null,null,null,null,null,{"$f":"$A$262&$B$262","v":"Summer2019"}]
[null,null,null,null,null,null,null,{"$f":"$A$262&$B$262","v":"Summer2019"}]
[null,null,null,null,null,null,null,"Summer2019"]
[null,null,null,null,null,null,null,"Summer2019"]
[null,null,null,null,null,null,null,"Summer2019"]
[null,null,null,null,null,null,null,"Summer2019"]
[" "," ",null,{"$f":"D86","v":"Semester Credits Earned"},{"$f":"SUM(E264:E269)","v":0},null,{"$f":"SUM(G263:G269)","v":0}]
[" "," ",null,{"$f":"D71","v":"Total Credits Earned"},{"$f":"E260+E270","v":0},null,{"$f":"G260-G270","v":120}]
[]
["Year 5"]
["Fall",{"$f":"B74+4","v":2019},{"$f":"C2","v":"Last Name, First Name"}]
["Course",{"$f":"B19","v":"Req."},{"$f":"C19","v":"Req."},"Course Title","Credits","Grade","Degree Credits","SemesterYear"]
[null,null,null,null,null,null,null,{"$f":"$A$274&$B$274","v":"Fall2019"}]
[null,null,null,null,null,null,null,{"$f":"$A$274&$B$274","v":"Fall2019"}]
[null,null,null,null,null,null,null,"Fall2019"]
[null,null,null,null,null,null,null,"Fall2019"]
[null,null,null,null,null,null,null,"Fall2019"]
[null,null,null,null,null,null,null,"Fall2019"]
[null,null,null,null,null,null,null,"Fall2019"]
[null,null,null,null,null,null,null,"Fall2019"]
[null,null,null,null,null,null,null,"Fall2019"]
[null,null,null,null,null,null,null,"Fall2019"]
[" "," ",null,{"$f":"D86","v":"Semester Credits Earned"},{"$f":"SUM(E276:E285)","v":0},null,{"$f":"SUM(G276:G285)","v":0}]
[" "," ",null,{"$f":"D71","v":"Total Credits Earned"},{"$f":"E271+E286","v":0},null,{"$f":"G271-G286","v":120}]
[]
["Winter",{"$f":"B74+5","v":2020},{"$f":"C2","v":"Last Name, First Name"}]
["Course",{"$f":"B19","v":"Req."},{"$f":"C19","v":"Req."},"Course Title","Credits","Grade","Degree Credits","SemesterYear"]
[null,null,null,null,null,null,null,{"$f":"$A$289&$B$289","v":"Winter2020"}]
[null,null,null,null,null,null,null,{"$f":"$A$289&$B$289","v":"Winter2020"}]
[null,null,null,null,null,null,null,"Winter2020"]
[" "," ",null,{"$f":"D86","v":"Semester Credits Earned"},{"$f":"SUM(E291:E293)","v":0},null,{"$f":"SUM(G291:G293)","v":0}]
[" "," ",null,{"$f":"D71","v":"Total Credits Earned"},{"$f":"E287+E294","v":0},null,{"$f":"G287-G294","v":120}]
[]
["Spring",{"$f":"B74+5","v":2020},{"$f":"C2","v":"Last Name, First Name"}]
["Course",{"$f":"B19","v":"Req."},{"$f":"C19","v":"Req."},"Course Title","Credits","Grade","Degree Credits","SemesterYear"]
[null,null,null,null,null,null,null,{"$f":"$A$297&$B$297","v":"Spring2020"}]
[null,null,null,null,null,null,null,{"$f":"$A$297&$B$297","v":"Spring2020"}]
[null,null,null,null,null,null,null,"Spring2020"]
[null,null,null,null,null,null,null,"Spring2020"]
[null,null,null,null,null,null,null,"Spring2020"]
[null,null,null,null,null,null,null,"Spring2020"]
[null,null,null,null,null,null,null,"Spring2020"]
[null,null,null,null,null,null,null,"Spring2020"]
[null,null,null,null,null,null,null,"Spring2020"]
[null,null,null,null,null,null,null,"Spring2020"]
[" "," ",null,{"$f":"D86","v":"Semester Credits Earned"},{"$f":"SUM(E299:E308)","v":0},null,{"$f":"SUM(G299:G308)","v":0}]
[" "," ",null,{"$f":"D71","v":"Total Credits Earned"},{"$f":"E295+E309","v":0},null,{"$f":"G295-G309","v":120}]
[]
["Summer",{"$f":"B74+5","v":2020},{"$f":"C2","v":"Last Name, First Name"}]
["Course",{"$f":"B19","v":"Req."},{"$f":"C19","v":"Req."},"Course Title","Credits","Grade","Degree Credits","SemesterYear"]
[null,null,null,null,null,null,null,{"$f":"$A$312&$B$312","v":"Summer2020"}]
[null,null,null,null,null,null,null,{"$f":"$A$312&$B$312","v":"Summer2020"}]
[null,null,null,null,null,null,null,"Summer2020"]
[null,null,null,null,null,null,null,"Summer2020"]
[null,null,null,null,null,null,null,"Summer2020"]
[null,null,null,null,null,null,null,"Summer2020"]
[" "," ",null,{"$f":"D86","v":"Semester Credits Earned"},{"$f":"SUM(E314:E319)","v":0},null,{"$f":"SUM(G313:G319)","v":0}]
[" "," ",null,{"$f":"D71","v":"Total Credits Earned"},{"$f":"E310+E320","v":0},null,{"$f":"G310-G320","v":120}]
[]
["Year 6"]
["Fall",{"$f":"B74+5","v":2020},{"$f":"C2","v":"Last Name, First Name"}]
["Course",{"$f":"B19","v":"Req."},{"$f":"C19","v":"Req."},"Course Title","Credits","Grade","Degree Credits","SemesterYear"]
[null,null,null,null,null,null,null,{"$f":"$A$324&$B$324","v":"Fall2020"}]
[null,null,null,null,null,null,null,{"$f":"$A$324&$B$324","v":"Fall2020"}]
[null,null,null,null,null,null,null,"Fall2020"]
[null,null,null,null,null,null,null,"Fall2020"]
[null,null,null,null,null,null,null,"Fall2020"]
[null,null,null,null,null,null,null,"Fall2020"]
[null,null,null,null,null,null,null,"Fall2020"]
[null,null,null,null,null,null,null,"Fall2020"]
[null,null,null,null,null,null,null,"Fall2020"]
[null,null,null,null,null,null,null,"Fall2020"]
[" "," ",null,{"$f":"D136","v":"Semester Credits Earned"},{"$f":"SUM(E326:E335)","v":0},null,{"$f":"SUM(G326:G335)","v":0}]
[" "," ",null,{"$f":"D121","v":"Total Credits Earned"},{"$f":"E321+E336","v":0},null,{"$f":"G321-G336","v":120}]
[]
["Winter",{"$f":"B74+6","v":2021},{"$f":"C2","v":"Last Name, First Name"}]
["Course",{"$f":"B19","v":"Req."},{"$f":"C19","v":"Req."},"Course Title","Credits","Grade","Degree Credits","SemesterYear"]
[null,null,null,null,null,null,null,{"$f":"$A$339&$B$339","v":"Winter2021"}]
[null,null,null,null,null,null,null,{"$f":"$A$339&$B$339","v":"Winter2021"}]
[null,null,null,null,null,null,null,"Winter2021"]
[" "," ",null,{"$f":"D136","v":"Semester Credits Earned"},{"$f":"SUM(E341:E343)","v":0},null,{"$f":"SUM(G341:G343)","v":0}]
[" "," ",null,{"$f":"D121","v":"Total Credits Earned"},{"$f":"E337+E344","v":0},null,{"$f":"G337-G344","v":120}]
[]
["Spring",{"$f":"B74+6","v":2021},{"$f":"C2","v":"Last Name, First Name"}]
["Course",{"$f":"B19","v":"Req."},{"$f":"C19","v":"Req."},"Course Title","Credits","Grade","Degree Credits","SemesterYear"]
[null,null,null,null,null,null,null,{"$f":"$A$347&$B$347","v":"Spring2021"}]
[null,null,null,null,null,null,null,{"$f":"$A$347&$B$347","v":"Spring2021"}]
[null,null,null,null,null,null,null,"Spring2021"]
[null,null,null,null,null,null,null,"Spring2021"]
[null,null,null,null,null,null,null,"Spring2021"]
[null,null,null,null,null,null,null,"Spring2021"]
[null,null,null,null,null,null,null,"Spring2021"]
[null,null,null,null,null,null,null,"Spring2021"]
[null,null,null,null,null,null,null,"Spring2021"]
[null,null,null,null,null,null,null,"Spring2021"]
[" "," ",null,{"$f":"D136","v":"Semester Credits Earned"},{"$f":"SUM(E349:E358)","v":0},null,{"$f":"SUM(G349:G358)","v":0}]
[" "," ",null,{"$f":"D121","v":"Total Credits Earned"},{"$f":"E345+E359","v":0},null,{"$f":"G345-G359","v":120}]
[]
["Summer",{"$f":"B74+6","v":2021},{"$f":"C2","v":"Last Name, First Name"}]
["Course",{"$f":"B19","v":"Req."},{"$f":"C19","v":"Req."},"Course Title","Credits","Grade","Degree Credits","SemesterYear"]
[null,null,null,null,null,null,null,{"$f":"$A$362&$B$362","v":"Summer2021"}]
[null,null,null,null,null,null,null,{"$f":"$A$362&$B$362","v":"Summer2021"}]
[null,null,null,null,null,null,null,"Summer2021"]
[null,null,null,null,null,null,null,"Summer2021"]
[null,null,null,null,null,null,null,"Summer2021"]
[null,null,null,null,null,null,null,"Summer2021"]
[" "," ",null,{"$f":"D136","v":"Semester Credits Earned"},{"$f":"SUM(E364:E369)","v":0},null,{"$f":"SUM(G363:G369)","v":0}]
[" "," ",null,{"$f":"D121","v":"Total Credits Earned"},{"$f":"E360+E370","v":0},null,{"$f":"G360-G370","v":120}]
[]
[]
[null,"Graduation Plan Review & Approval"]
[]
[]
[]
[null,"Initial Review: OASiS",null,null,"Date"]
[]
[]
[]
[null,"Additional Review: Faculty Mentor",null,null,"Date"]
[]
[null," ",null,null," "]
[]
[null,"Secondary Major Review",null,null,"Date"]
[]
[null," ",null,null," "]
[]
[null,"Final Review: OASiS Approval",null,null,"Date"]
[]
[null," ",null,null," "]
[]
[null,{"$f":"C2","v":"Last Name, First Name"},null,null,"Date"]
[]
[]
[]
[]
[null,"OASiS Comments"]

{"sheet":"Checklist_Data Science","index":12,"n_rows":116,"n_cols":13,"rows_kept":116,"cut":false,"hidden":true,"merged":[[2,0,2,8],[0,0,0,8],[0,11,0,12],[1,0,1,2],[1,4,1,6],[1,11,1,12],[18,0,18,8],[21,0,21,8],[23,0,23,8],[27,0,27,8],[28,0,28,2],[28,4,28,6],[65,0,65,8],[65,11,65,12],[29,0,29,8],[31,0,31,8],[41,0,41,8],[41,11,41,12],[42,0,42,2],[42,4,42,6],[42,11,42,12],[56,0,56,8],[56,11,56,12],[57,0,57,2],[57,4,57,6],[57,11,57,12],[86,0,86,2],[86,4,86,6],[86,11,86,12],[66,0,66,2],[66,4,66,6],[66,11,66,12],[67,11,67,12],[77,0,77,8],[78,0,78,2],[78,4,78,6],[81,0,81,8],[82,0,82,2],[82,4,82,6],[85,0,85,8],[85,11,85,12],[108,0,108,8],[109,0,109,8],[111,0,111,8],[87,0,87,8],[90,0,90,8],[92,0,92,8],[96,0,96,8],[100,0,100,8],[105,0,105,8]]}
["Checklist - Data Science",null,null,null,null,null,null,null,null,null,"Graduation_Plan","Required Data Science Electives"]
["Requirement",null,null,"Credits","Taken",null,null,"Semester","Credits",null,null,"List courses you are interested in possibly taking. (NOTE: This is not required.)"]
["Required Computer Science Courses",null,null,null,null,null,null,null,null,null,null,"Course","Title"]
["COMP.1010","or","91.101",3,"COMP.1010","or","91.101",{"$f":"IF(AND(ISNA(VLOOKUP(E4,INDIRECT(\"'\"&$K$1&\"'!$A$1:$H$550\"),8,FALSE)), ISNA(VLOOKUP(G4,INDIRECT(\"'\"&$K$1&\"'!$A$1:$H$550\"),8,FALSE))), \"Not Found\", (IF(ISNA(VLOOKUP(E4,INDIRECT(\"'\"&$K$1&\"'!$A$1:$H$550\"),8,FALSE)), VLOOKUP(G4,INDIRECT(\"'\"&$K$1&\"'!$A$1:$H$550\"),8,FALSE), VLOOKUP(E4,INDIRECT(\"'\"&$K$1&\"'!$A$1:$H$550\"),8,FALSE))))","v":"Not Found"},{"$f":"IF(AND(ISNA(VLOOKUP(E4,INDIRECT(\"'\"&$K$1&\"'!$A$1:$H$550\"),5,FALSE)), ISNA(VLOOKUP(G4,INDIRECT(\"'\"&$K$1&\"'!$A$1:$H$550\"),5,FALSE))), \"0\", (IF(ISNA(VLOOKUP(E4,INDIRECT(\"'\"&$K$1&\"'!$A$1:$H$550\"),5,FALSE)), VLOOKUP(G4,INDIRECT(\"'\"&$K$1&\"'!$A$1:$H$550\"),5,FALSE), VLOOKUP(E4,INDIRECT(\"'\"&$K$1&\"'!$A$1:$H$550\"),5,FALSE))))","v":"0"}]
["COMP.1030L","or","91.103",1,"COMP.1030L","or","91.103",{"$f":"IF(AND(ISNA(VLOOKUP(E5,INDIRECT(\"'\"&$K$1&\"'!$A$1:$H$550\"),8,FALSE)), ISNA(VLOOKUP(G5,INDIRECT(\"'\"&$K$1&\"'!$A$1:$H$550\"),8,FALSE))), \"Not Found\", (IF(ISNA(VLOOKUP(E5,INDIRECT(\"'\"&$K$1&\"'!$A$1:$H$550\"),8,FALSE)), VLOOKUP(G5,INDIRECT(\"'\"&$K$1&\"'!$A$1:$H$550\"),8,FALSE), VLOOKUP(E5,INDIRECT(\"'\"&$K$1&\"'!$A$1:$H$550\"),8,FALSE))))","v":"Not Found"},"0"]
["COMP.1020","or","91.102",3,"COMP.1020","or","91.102","Not Found",{"$f":"IF(AND(ISNA(VLOOKUP(E6,INDIRECT(\"'\"&$K$1&\"'!$A$1:$H$550\"),5,FALSE)), ISNA(VLOOKUP(G6,INDIRECT(\"'\"&$K$1&\"'!$A$1:$H$550\"),5,FALSE))), \"0\", (IF(ISNA(VLOOKUP(E6,INDIRECT(\"'\"&$K$1&\"'!$A$1:$H$550\"),5,FALSE)), VLOOKUP(G6,INDIRECT(\"'\"&$K$1&\"'!$A$1:$H$550\"),5,FALSE), VLOOKUP(E6,INDIRECT(\"'\"&$K$1&\"'!$A$1:$H$550\"),5,FALSE))))","v":"0"}]
["COMP.1040L","or","91.104",1,"COMP.1040L","or","91.104","Not Found",{"$f":"IF(AND(ISNA(VLOOKUP(E7,INDIRECT(\"'\"&$K$1&\"'!$A$1:$H$550\"),5,FALSE)), ISNA(VLOOKUP(G7,INDIRECT(\"'\"&$K$1&\"'!$A$1:$H$550\"),5,FALSE))), \"0\", (IF(ISNA(VLOOKUP(E7,INDIRECT(\"'\"&$K$1&\"'!$A$1:$H$550\"),5,FALSE)), VLOOKUP(G7,INDIRECT(\"'\"&$K$1&\"'!$A$1:$H$550\"),5,FALSE), VLOOKUP(E7,INDIRECT(\"'\"&$K$1&\"'!$A$1:$H$550\"),5,FALSE))))","v":"0"}]
["COMP.2010","or","91.201",3,"COMP.2010","or","91.201","Not Found","0"]
["COMP.2010L",null,null,1,"COMP.2010L",null,null,{"$f":"IF(AND(ISNA(VLOOKUP(E9,INDIRECT(\"'\"&$K$1&\"'!$A$1:$H$550\"),8,FALSE)), ISNA(VLOOKUP(G9,INDIRECT(\"'\"&$K$1&\"'!$A$1:$H$550\"),8,FALSE))), \"Not Found\", (IF(ISNA(VLOOKUP(E9,INDIRECT(\"'\"&$K$1&\"'!$A$1:$H$550\"),8,FALSE)), VLOOKUP(G9,INDIRECT(\"'\"&$K$1&\"'!$A$1:$H$550\"),8,FALSE), VLOOKUP(E9,INDIRECT(\"'\"&$K$1&\"'!$A$1:$H$550\"),8,FALSE))))","v":"Not Found"},{"$f":"IF(AND(ISNA(VLOOKUP(E9,INDIRECT(\"'\"&$K$1&\"'!$A$1:$H$550\"),5,FALSE)), ISNA(VLOOKUP(G9,INDIRECT(\"'\"&$K$1&\"'!$A$1:$H$550\"),5,FALSE))), \"0\", (IF(ISNA(VLOOKUP(E9,INDIRECT(\"'\"&$K$1&\"'!$A$1:$H$550\"),5,FALSE)), VLOOKUP(G9,INDIRECT(\"'\"&$K$1&\"'!$A$1:$H$550\"),5,FALSE), VLOOKUP(E9,INDIRECT(\"'\"&$K$1&\"'!$A$1:$H$550\"),5,FALSE))))","v":"0"}]
["COMP.2030","or","91.203",3,"COMP.2030","or","91.203","Not Found","0"]
["COMP.2030L",null,null,1,"COMP.2030L",null,null,{"$f":"IF(AND(ISNA(VLOOKUP(E11,INDIRECT(\"'\"&$K$1&\"'!$A$1:$H$550\"),8,FALSE)), ISNA(VLOOKUP(G11,INDIRECT(\"'\"&$K$1&\"'!$A$1:$H$550\"),8,FALSE))), \"Not Found\", (IF(ISNA(VLOOKUP(E11,INDIRECT(\"'\"&$K$1&\"'!$A$1:$H$550\"),8,FALSE)), VLOOKUP(G11,INDIRECT(\"'\"&$K$1&\"'!$A$1:$H$550\"),8,FALSE), VLOOKUP(E11,INDIRECT(\"'\"&$K$1&\"'!$A$1:$H$550\"),8,FALSE))))","v":"Not Found"},{"$f":"IF(AND(ISNA(VLOOKUP(E11,INDIRECT(\"'\"&$K$1&\"'!$A$1:$H$550\"),5,FALSE)), ISNA(VLOOKUP(G11,INDIRECT(\"'\"&$K$1&\"'!$A$1:$H$550\"),5,FALSE))), \"0\", (IF(ISNA(VLOOKUP(E11,INDIRECT(\"'\"&$K$1&\"'!$A$1:$H$550\"),5,FALSE)), VLOOKUP(G11,INDIRECT(\"'\"&$K$1&\"'!$A$1:$H$550\"),5,FALSE), VLOOKUP(E11,INDIRECT(\"'\"&$K$1&\"'!$A$1:$H$550\"),5,FALSE))))","v":"0"}]
["COMP.2040","or","91.204",3,"COMP.2040","or","91.204","Not Found","0"]
["COMP.3010","or","91.301",3,"COMP.3010","or","91.301","Not Found","0"]
["COMP.3040","or","91.304",3,"COMP.3040","or","91.304","Not Found","0"]
["COMP.3050","or","91.305",3,"COMP.3050","or","91.305","Not Found","0"]
["COMP.3080","or","91.308",3,"COMP.3080","or","91.308","Not Found","0"]
["COMP.4040","or","91.404",3,"COMP.4040","or","91.404","Not Found","0"]
["COMP.4220","or","91.422",3,"COMP.4220","or","91.422","Not Found","0"]
["Upper Level Data Science Elective"]
["DSE-1",null,null,3,{"$f":"IF(ISNA(INDEX(INDIRECT(\"'\"&$K$1&\"'!$A$1:$A$550\"), MATCH(A20,INDIRECT(\"'\"&$K$1&\"'!$B$1:$B$550\"),0))), \"Not Found\", (INDEX(INDIRECT(\"'\"&$K$1&\"'!$A$1:$A$550\"), MATCH(A20,INDIRECT(\"'\"&$K$1&\"'!$B$1:$B$550\"),0))))","v":"Not Found"},null,null,{"$f":"IF(ISNA(VLOOKUP(E20,INDIRECT(\"'\"&$K$1&\"'!$A$1:$H$550\"),8,FALSE)), \"Not Found\", VLOOKUP(E20,INDIRECT(\"'\"&$K$1&\"'!$A$1:$H$550\"),8,FALSE))","v":"Not Found"},{"$f":"IF(ISNA(VLOOKUP(E20,INDIRECT(\"'\"&$K$1&\"'!$A$1:$H$550\"),5,FALSE)), \"0\", VLOOKUP(E20,INDIRECT(\"'\"&$K$1&\"'!$A$1:$H$550\"),5,FALSE))","v":"0"}]
["DSE-2",null,null,3,"Not Found",null,null,"Not Found","0"]
["General CS Upper Level Elective"]
["CSE-1",null,null,3,"Not Found",null,null,{"$f":"IF(ISNA(VLOOKUP(E23,INDIRECT(\"'\"&$K$1&\"'!$A$1:$H$550\"),8,FALSE)), \"Not Found\", VLOOKUP(E23,INDIRECT(\"'\"&$K$1&\"'!$A$1:$H$550\"),8,FALSE))","v":"Not Found"},{"$f":"IF(ISNA(VLOOKUP(E23,INDIRECT(\"'\"&$K$1&\"'!$A$1:$H$550\"),5,FALSE)), \"0\", VLOOKUP(E23,INDIRECT(\"'\"&$K$1&\"'!$A$1:$H$550\"),5,FALSE))","v":"0"}]
["CS Project Course"]
["Sr.Prj-1",null,null,3,{"$f":"IF(ISNA(INDEX(INDIRECT(\"'\"&$K$1&\"'!$A$1:$A$550\"), MATCH(A25,INDIRECT(\"'\"&$K$1&\"'!$C$1:$C$550\"),0))), \"Not Found\", (INDEX(INDIRECT(\"'\"&$K$1&\"'!$A$1:$A$550\"), MATCH(A25,INDIRECT(\"'\"&$K$1&\"'!$C$1:$C$550\"),0))))","v":"Not Found"},null,null,{"$f":"IF(ISNA(VLOOKUP(E25,INDIRECT(\"'\"&$K$1&\"'!$A$1:$H$550\"),8,FALSE)), \"Not Found\", VLOOKUP(E25,INDIRECT(\"'\"&$K$1&\"'!$A$1:$H$550\"),8,FALSE))","v":"Not Found"},{"$f":"IF(ISNA(VLOOKUP(E25,INDIRECT(\"'\"&$K$1&\"'!$A$1:$H$550\"),5,FALSE)), \"0\", VLOOKUP(E25,INDIRECT(\"'\"&$K$1&\"'!$A$1:$H$550\"),5,FALSE))","v":"0"}]
["Sr.Prj-2",null,null,3,{"$f":"IF(ISNA(INDEX(INDIRECT(\"'\"&$K$1&\"'!$A$1:$A$550\"), MATCH(A26,INDIRECT(\"'\"&$K$1&\"'!$C$1:$C$550\"),0))), \"Not Found\", (INDEX(INDIRECT(\"'\"&$K$1&\"'!$A$1:$A$550\"), MATCH(A26,INDIRECT(\"'\"&$K$1&\"'!$C$1:$C$550\"),0))))","v":"Not Found"},null,null,"Not Found","0"]
[]
["Required Supporting Technical Course"]
["Requirement",null,null,"Credits","Taken",null,null,"Semester","Credits"]
["Electrical Engineering"]
["EECE.2650","or","16.265",3,"EECE.2650","or","16.265",{"$f":"IF(AND(ISNA(VLOOKUP(E31,INDIRECT(\"'\"&$K$1&\"'!$A$1:$H$550\"),8,FALSE)), ISNA(VLOOKUP(G31,INDIRECT(\"'\"&$K$1&\"'!$A$1:$H$550\"),8,FALSE))), \"Not Found\", (IF(ISNA(VLOOKUP(E31,INDIRECT(\"'\"&$K$1&\"'!$A$1:$H$550\"),8,FALSE)), VLOOKUP(G31,INDIRECT(\"'\"&$K$1&\"'!$A$1:$H$550\"),8,FALSE), VLOOKUP(E31,INDIRECT(\"'\"&$K$1&\"'!$A$1:$H$550\"),8,FALSE))))","v":"Not Found"},{"$f":"IF(AND(ISNA(VLOOKUP(E31,INDIRECT(\"'\"&$K$1&\"'!$A$1:$H$550\"),5,FALSE)), ISNA(VLOOKUP(G31,INDIRECT(\"'\"&$K$1&\"'!$A$1:$H$550\"),5,FALSE))), \"0\", (IF(ISNA(VLOOKUP(E31,INDIRECT(\"'\"&$K$1&\"'!$A$1:$H$550\"),5,FALSE)), VLOOKUP(G31,INDIRECT(\"'\"&$K$1&\"'!$A$1:$H$550\"),5,FALSE), VLOOKUP(E31,INDIRECT(\"'\"&$K$1&\"'!$A$1:$H$550\"),5,FALSE))))","v":"0"}]
["Mathematics"]
["MATH.1310","or","92.131",4,"MATH.1310","or","92.131",{"$f":"IF(AND(ISNA(VLOOKUP(E33,INDIRECT(\"'\"&$K$1&\"'!$A$1:$H$550\"),8,FALSE)), ISNA(VLOOKUP(G33,INDIRECT(\"'\"&$K$1&\"'!$A$1:$H$550\"),8,FALSE))), \"Not Found\", (IF(ISNA(VLOOKUP(E33,INDIRECT(\"'\"&$K$1&\"'!$A$1:$H$550\"),8,FALSE)), VLOOKUP(G33,INDIRECT(\"'\"&$K$1&\"'!$A$1:$H$550\"),8,FALSE), VLOOKUP(E33,INDIRECT(\"'\"&$K$1&\"'!$A$1:$H$550\"),8,FALSE))))","v":"Not Found"},{"$f":"IF(AND(ISNA(VLOOKUP(E33,INDIRECT(\"'\"&$K$1&\"'!$A$1:$H$550\"),5,FALSE)), ISNA(VLOOKUP(G33,INDIRECT(\"'\"&$K$1&\"'!$A$1:$H$550\"),5,FALSE))), \"0\", (IF(ISNA(VLOOKUP(E33,INDIRECT(\"'\"&$K$1&\"'!$A$1:$H$550\"),5,FALSE)), VLOOKUP(G33,INDIRECT(\"'\"&$K$1&\"'!$A$1:$H$550\"),5,FALSE), VLOOKUP(E33,INDIRECT(\"'\"&$K$1&\"'!$A$1:$H$550\"),5,FALSE))))","v":"0"}]
["MATH.1320","or","92.132",4,"MATH.1320","or","92.132","Not Found","0"]
["MATH.2210","or","92.221",3,"MATH.2210","or","92.221","Not Found","0"]
["MATH.2220","or","92.222",3,"MATH.2220","or","92.222","Not Found","0"]
["MATH.2310","or","92.231",4,"MATH.2310","or","92.231","Not Found","0"]
["MATH.3210","or","92.321",3,"MATH.3210","or","92.321","Not Found","0"]
["MATH.3220","or","92.322",3,"MATH.3220","or","92.322","Not Found","0"]
["MATH.3860","or","92.386",3,"MATH.3860","or","92.386","Not Found","0"]
[]
["Natural Science Electives",null,null,null,null,null,null,null,null,null,null,"Natural Science Electives"]
["Requirement",null,null,"Credits","Taken",null,null,"Semester","Credits",null,null,"List courses you are interested in possibly taking to satisfy this requirement"]
["NS-1",null,null,3,{"$f":"IF(ISNA(INDEX(INDIRECT(\"'\"&$K$1&\"'!$A$1:$A$550\"), MATCH(A44,INDIRECT(\"'\"&$K$1&\"'!$C$1:$C$550\"),0))), \"Not Found\", (INDEX(INDIRECT(\"'\"&$K$1&\"'!$A$1:$A$550\"), MATCH(A44,INDIRECT(\"'\"&$K$1&\"'!$C$1:$C$550\"),0))))","v":"Not Found"},null,null,{"$f":"IF(ISNA(VLOOKUP(E44,INDIRECT(\"'\"&$K$1&\"'!$A$1:$H$550\"),8,FALSE)), \"Not Found\", VLOOKUP(E44,INDIRECT(\"'\"&$K$1&\"'!$A$1:$H$550\"),8,FALSE))","v":"Not Found"},{"$f":"IF(ISNA(VLOOKUP(E44,INDIRECT(\"'\"&$K$1&\"'!$A$1:$H$550\"),5,FALSE)), \"0\", VLOOKUP(E44,INDIRECT(\"'\"&$K$1&\"'!$A$1:$H$550\"),5,FALSE))","v":"0"},null,null,"Course","Title"]
["NS-Lab1",null,null,1,{"$f":"IF(ISNA(INDEX(INDIRECT(\"'\"&$K$1&\"'!$A$1:$A$550\"), MATCH(A45,INDIRECT(\"'\"&$K$1&\"'!$C$1:$C$550\"),0))), \"Not Found\", (INDEX(INDIRECT(\"'\"&$K$1&\"'!$A$1:$A$550\"), MATCH(A45,INDIRECT(\"'\"&$K$1&\"'!$C$1:$C$550\"),0))))","v":"Not Found"},null,null,"Not Found","0"]
["NS-2",null,null,3,"Not Found",null,null,"Not Found","0"]
["NS-Lab2",null,null,1,"Not Found",null,null,"Not Found","0"]
["NS-3",null,null,3,"Not Found",null,null,"Not Found","0"]
["NS-Lab3",null,null,1,"Not Found",null,null,"Not Found","0"]
["Not Req.",null,null,"n/a","Not Found",null,null,"Not Found","0"]
["Not Req.",null,null,"n/a","Not Found",null,null,"Not Found","0"]
[]
[]
[]
[]
[]
["Technical Elective",null,null,null,null,null,null,null,null,null,null,"Technical Elective"]
["Requirement",null,null,"Credits","Taken",null,null,"Semester","Credits",null,null,"List courses you are interested in possibly taking to satisfy this requirement"]
["TE-1",null,null,3,{"$f":"IF(ISNA(INDEX(INDIRECT(\"'\"&$K$1&\"'!$A$1:$A$550\"), MATCH(A59,INDIRECT(\"'\"&$K$1&\"'!$B$1:$B$550\"),0))), \"Not Found\", (INDEX(INDIRECT(\"'\"&$K$1&\"'!$A$1:$A$550\"), MATCH(A59,INDIRECT(\"'\"&$K$1&\"'!$B$1:$B$550\"),0))))","v":"Not Found"},null,null,{"$f":"IF(ISNA(VLOOKUP(E59,INDIRECT(\"'\"&$K$1&\"'!$A$1:$H$550\"),8,FALSE)), \"Not Found\", VLOOKUP(E59,INDIRECT(\"'\"&$K$1&\"'!$A$1:$H$550\"),8,FALSE))","v":"Not Found"},{"$f":"IF(ISNA(VLOOKUP(E59,INDIRECT(\"'\"&$K$1&\"'!$A$1:$H$550\"),5,FALSE)), \"0\", VLOOKUP(E59,INDIRECT(\"'\"&$K$1&\"'!$A$1:$H$550\"),5,FALSE))","v":"0"},null,null,"Course","Title"]
["Not Req.",null,null,"n/a","Not Found",null,null,"Not Found","0"]
[]
[]
[]
[]
[]
["Free Electives (FE)",null,null,null,null,null,null,null,null,null,null,"Free Electives"]
["Requirement",null,null,"Credits","Taken",null,null,"Semester","Credits",null,null,"List free electives you are interested in taking.  These cannot be below the level of a"]
["FE-1",null,null,3,{"$f":"IF(ISNA(INDEX(INDIRECT(\"'\"&$K$1&\"'!$A$1:$A$550\"), MATCH(\"*\"&A68&\"*\",INDIRECT(\"'\"&$K$1&\"'!$B$1:$B$550\"),0))), \"Not Found\", (INDEX(INDIRECT(\"'\"&$K$1&\"'!$A$1:$A$550\"), MATCH(\"*\"&A68&\"*\",INDIRECT(\"'\"&$K$1&\"'!$B$1:$B$550\"),0))))","v":"Not Found"},null,null,{"$f":"IF(ISNA(VLOOKUP(E68,INDIRECT(\"'\"&$K$1&\"'!$A$1:$H$550\"),8,FALSE)), \"Not Found\", VLOOKUP(E68,INDIRECT(\"'\"&$K$1&\"'!$A$1:$H$550\"),8,FALSE))","v":"Not Found"},{"$f":"IF(ISNA(VLOOKUP(E68,INDIRECT(\"'\"&$K$1&\"'!$A$1:$H$550\"),5,FALSE)), \"0\", VLOOKUP(E68,INDIRECT(\"'\"&$K$1&\"'!$A$1:$H$550\"),5,FALSE))","v":"0"},null,null,"required course.  Specific courses may be recommended for different CS tracks."]
["FE-2",null,null,2,"Not Found",null,null,"Not Found","0"]
["Not Req.",null,null,"n/a","Not Found",null,null,"Not Found","0"]
["Not Req.",null,null,"n/a","Not Found",null,null,"Not Found","0"]
["Not Req.",null,null,"n/a","Not Found",null,null,"Not Found","0"]
["Not Req.",null,null,"n/a","Not Found",null,null,"Not Found","0"]
[]
["Required FE Credits",null,null,null,null,null,null,"Projected Credits"]
[null,null,null,{"$f":"120-SUM(D4:D23, D31:D59:D60, D89:D90,D94:D100)","v":5},null,null,null,null,{"$f":"SUM(I68:I74)","v":0}]
[]
["Oral & Written Communication"]
["Requirement",null,null,"Credits","Taken",null,null,"Semester","Credits"]
["ENGL.2200","or","42.220",3,"ENGL.2200","or","42.220",{"$f":"IF(AND(ISNA(VLOOKUP(E80,INDIRECT(\"'\"&$K$1&\"'!$A$1:$H$550\"),8,FALSE)), ISNA(VLOOKUP(G80,INDIRECT(\"'\"&$K$1&\"'!$A$1:$H$550\"),8,FALSE))), \"Not Found\", (IF(ISNA(VLOOKUP(E80,INDIRECT(\"'\"&$K$1&\"'!$A$1:$H$550\"),8,FALSE)), VLOOKUP(G80,INDIRECT(\"'\"&$K$1&\"'!$A$1:$H$550\"),8,FALSE), VLOOKUP(E80,INDIRECT(\"'\"&$K$1&\"'!$A$1:$H$550\"),8,FALSE))))","v":"Not Found"},{"$f":"IF(AND(ISNA(VLOOKUP(E80,INDIRECT(\"'\"&$K$1&\"'!$A$1:$H$550\"),5,FALSE)), ISNA(VLOOKUP(G80,INDIRECT(\"'\"&$K$1&\"'!$A$1:$H$550\"),5,FALSE))), \"0\", (IF(ISNA(VLOOKUP(E80,INDIRECT(\"'\"&$K$1&\"'!$A$1:$H$550\"),5,FALSE)), VLOOKUP(G80,INDIRECT(\"'\"&$K$1&\"'!$A$1:$H$550\"),5,FALSE), VLOOKUP(E80,INDIRECT(\"'\"&$K$1&\"'!$A$1:$H$550\"),5,FALSE))))","v":"0"}]
[]
["CS Ethics Requirement"]
["Requirement",null,null,"Credits","Taken",null,null,"Semester","Credits"]
["CSET",null,null,3,{"$f":"IF(ISNA(INDEX(INDIRECT(\"'\"&$K$1&\"'!$A$1:$A$550\"), MATCH(A84,INDIRECT(\"'\"&$K$1&\"'!$C$1:$C$550\"),0))), \"Not Found\", (INDEX(INDIRECT(\"'\"&$K$1&\"'!$A$1:$A$550\"), MATCH(A84,INDIRECT(\"'\"&$K$1&\"'!$C$1:$C$550\"),0))))","v":"Not Found"},null,null,{"$f":"IF(ISNA(VLOOKUP(E84,INDIRECT(\"'\"&$K$1&\"'!$A$1:$H$550\"),8,FALSE)), \"Not Found\", VLOOKUP(E84,INDIRECT(\"'\"&$K$1&\"'!$A$1:$H$550\"),8,FALSE))","v":"Not Found"},{"$f":"IF(ISNA(VLOOKUP(E84,INDIRECT(\"'\"&$K$1&\"'!$A$1:$H$550\"),5,FALSE)), \"0\", VLOOKUP(E84,INDIRECT(\"'\"&$K$1&\"'!$A$1:$H$550\"),5,FALSE))","v":"0"}]
[]
["Breadth of Knowledge",null,null,null,null,null,null,null,null,null,null," Breadth of Knowledge Requirements"]
["Requirement",null,null,"Credits","Taken",null,null,"Semester","Credits",null,null,"Select courses you are interested in taking to satisfy this Requirements."]
["College Writing",null,null,null,null,null,null,null,null,null,null,"Area","Title"]
["CW-1",null,null,3,{"$f":"IF(ISNA(INDEX(INDIRECT(\"'\"&$K$1&\"'!$A$1:$A$550\"), MATCH(A89,INDIRECT(\"'\"&$K$1&\"'!$B$1:$B$550\"),0))), \"Not Found\", (INDEX(INDIRECT(\"'\"&$K$1&\"'!$A$1:$A$550\"), MATCH(A89,INDIRECT(\"'\"&$K$1&\"'!$B$1:$B$550\"),0))))","v":"Not Found"},null,null,{"$f":"IF(ISNA(VLOOKUP(E89,INDIRECT(\"'\"&$K$1&\"'!$A$1:$H$550\"),8,FALSE)), \"Not Found\", VLOOKUP(E89,INDIRECT(\"'\"&$K$1&\"'!$A$1:$H$550\"),8,FALSE))","v":"Not Found"},{"$f":"IF(ISNA(VLOOKUP(E89,INDIRECT(\"'\"&$K$1&\"'!$A$1:$H$550\"),5,FALSE)), \"0\", VLOOKUP(E89,INDIRECT(\"'\"&$K$1&\"'!$A$1:$H$550\"),5,FALSE))","v":"0"}]
["CW-2",null,null,3,"Not Found",null,null,"Not Found","0"]
["Mathematics"]
["MA",null,null,4,{"$f":"IF(ISNA(INDEX(INDIRECT(\"'\"&$K$1&\"'!$A$1:$A$550\"), MATCH(A92,INDIRECT(\"'\"&$K$1&\"'!$B$1:$B$550\"),0))), \"Not Found\", (INDEX(INDIRECT(\"'\"&$K$1&\"'!$A$1:$A$550\"), MATCH(A92,INDIRECT(\"'\"&$K$1&\"'!$B$1:$B$550\"),0))))","v":"Not Found"},null,null,{"$f":"IF(ISNA(VLOOKUP(E92,INDIRECT(\"'\"&$K$1&\"'!$A$1:$H$550\"),8,FALSE)), \"Not Found\", VLOOKUP(E92,INDIRECT(\"'\"&$K$1&\"'!$A$1:$H$550\"),8,FALSE))","v":"Not Found"},{"$f":"IF(ISNA(VLOOKUP(E92,INDIRECT(\"'\"&$K$1&\"'!$A$1:$H$550\"),5,FALSE)), \"0\", VLOOKUP(E92,INDIRECT(\"'\"&$K$1&\"'!$A$1:$H$550\"),5,FALSE))","v":"0"}]
["Arts & Humanities"]
["AH-1",null,null,3,{"$f":"IF(ISNA(INDEX(INDIRECT(\"'\"&$K$1&\"'!$A$1:$A$550\"), MATCH(\"*\"&A94&\"*\",INDIRECT(\"'\"&$K$1&\"'!$B$1:$B$550\"),0))), \"Not Found\", (INDEX(INDIRECT(\"'\"&$K$1&\"'!$A$1:$A$550\"), MATCH(\"*\"&A94&\"*\",INDIRECT(\"'\"&$K$1&\"'!$B$1:$B$550\"),0))))","v":"Not Found"},null,null,{"$f":"IF(ISNA(VLOOKUP(E94,INDIRECT(\"'\"&$K$1&\"'!$A$1:$H$550\"),8,FALSE)), \"Not Found\", VLOOKUP(E94,INDIRECT(\"'\"&$K$1&\"'!$A$1:$H$550\"),8,FALSE))","v":"Not Found"},{"$f":"IF(ISNA(VLOOKUP(E94,INDIRECT(\"'\"&$K$1&\"'!$A$1:$H$550\"),5,FALSE)), \"0\", VLOOKUP(E94,INDIRECT(\"'\"&$K$1&\"'!$A$1:$H$550\"),5,FALSE))","v":"0"}]
["AH-2",null,null,3,{"$f":"IF(ISNA(INDEX(INDIRECT(\"'\"&$K$1&\"'!$A$1:$A$550\"), MATCH(\"*\"&A95&\"*\",INDIRECT(\"'\"&$K$1&\"'!$B$1:$B$550\"),0))), \"Not Found\", (INDEX(INDIRECT(\"'\"&$K$1&\"'!$A$1:$A$550\"), MATCH(\"*\"&A95&\"*\",INDIRECT(\"'\"&$K$1&\"'!$B$1:$B$550\"),0))))","v":"Not Found"},null,null,"Not Found","0"]
["AH-3",null,null,3,"Not Found",null,null,"Not Found","0"]
["Social Sciences"]
["SS-1",null,null,3,{"$f":"IF(ISNA(INDEX(INDIRECT(\"'\"&$K$1&\"'!$A$1:$A$550\"), MATCH(\"*\"&A98&\"*\",INDIRECT(\"'\"&$K$1&\"'!$B$1:$B$550\"),0))), \"Not Found\", (INDEX(INDIRECT(\"'\"&$K$1&\"'!$A$1:$A$550\"), MATCH(\"*\"&A98&\"*\",INDIRECT(\"'\"&$K$1&\"'!$B$1:$B$550\"),0))))","v":"Not Found"},null,null,{"$f":"IF(ISNA(VLOOKUP(E98,INDIRECT(\"'\"&$K$1&\"'!$A$1:$H$550\"),8,FALSE)), \"Not Found\", VLOOKUP(E98,INDIRECT(\"'\"&$K$1&\"'!$A$1:$H$550\"),8,FALSE))","v":"Not Found"},{"$f":"IF(ISNA(VLOOKUP(E98,INDIRECT(\"'\"&$K$1&\"'!$A$1:$H$550\"),5,FALSE)), \"0\", VLOOKUP(E98,INDIRECT(\"'\"&$K$1&\"'!$A$1:$H$550\"),5,FALSE))","v":"0"}]
["SS-2",null,null,3,"Not Found",null,null,"Not Found","0"]
["SS-3",null,null,3,"Not Found",null,null,"Not Found","0"]
["Sciences with Lab"]
["SC-1",null,null,3,{"$f":"IF(ISNA(INDEX(INDIRECT(\"'\"&$K$1&\"'!$A$1:$A$550\"), MATCH(A102,INDIRECT(\"'\"&$K$1&\"'!$B$1:$B$550\"),0))), \"Not Found\", (INDEX(INDIRECT(\"'\"&$K$1&\"'!$A$1:$A$550\"), MATCH(A102,INDIRECT(\"'\"&$K$1&\"'!$B$1:$B$550\"),0))))","v":"Not Found"},null,null,{"$f":"IF(ISNA(VLOOKUP(E102,INDIRECT(\"'\"&$K$1&\"'!$A$1:$H$550\"),8,FALSE)), \"Not Found\", VLOOKUP(E102,INDIRECT(\"'\"&$K$1&\"'!$A$1:$H$550\"),8,FALSE))","v":"Not Found"},{"$f":"IF(ISNA(VLOOKUP(E102,INDIRECT(\"'\"&$K$1&\"'!$A$1:$H$550\"),5,FALSE)), \"0\", VLOOKUP(E102,INDIRECT(\"'\"&$K$1&\"'!$A$1:$H$550\"),5,FALSE))","v":"0"}]
["SCL-1",null,null,1,"Not Found",null,null,"Not Found","0"]
["SC-2",null,null,3,"Not Found",null,null,"Not Found","0"]
["SCL-2",null,null,1,"Not Found",null,null,"Not Found","0"]
["STEM"]
["STEM",null,null,3,{"$f":"IF(ISNA(INDEX(INDIRECT(\"'\"&$K$1&\"'!$A$1:$A$550\"), MATCH(A107,INDIRECT(\"'\"&$K$1&\"'!$B$1:$B$550\"),0))), \"Not Found\", (INDEX(INDIRECT(\"'\"&$K$1&\"'!$A$1:$A$550\"), MATCH(A107,INDIRECT(\"'\"&$K$1&\"'!$B$1:$B$550\"),0))))","v":"Not Found"},null,null,{"$f":"IF(ISNA(VLOOKUP(E107,INDIRECT(\"'\"&$K$1&\"'!$A$1:$H$550\"),8,FALSE)), \"Not Found\", VLOOKUP(E107,INDIRECT(\"'\"&$K$1&\"'!$A$1:$H$550\"),8,FALSE))","v":"Not Found"},{"$f":"IF(ISNA(VLOOKUP(E107,INDIRECT(\"'\"&$K$1&\"'!$A$1:$H$550\"),5,FALSE)), \"0\", VLOOKUP(E107,INDIRECT(\"'\"&$K$1&\"'!$A$1:$H$550\"),5,FALSE))","v":"0"}]
[]
["Diversity & Ethics ELOs"]
["Diversity & Cultural Awareness (DV)"]
["DV",null,null,3,{"$f":"IF(ISNA(INDEX(INDIRECT(\"'\"&$K$1&\"'!$A$1:$A$550\"), MATCH(\"*\"&A111&\"*\",INDIRECT(\"'\"&$K$1&\"'!$B$1:$B$550\"),0))), \"Not Found\", (INDEX(INDIRECT(\"'\"&$K$1&\"'!$A$1:$A$550\"), MATCH(\"*\"&A111&\"*\",INDIRECT(\"'\"&$K$1&\"'!$B$1:$B$550\"),0))))","v":"Not Found"},null,null,{"$f":"IF(ISNA(VLOOKUP(E111,INDIRECT(\"'\"&$K$1&\"'!$A$1:$H$550\"),8,FALSE)), \"Not Found\", VLOOKUP(E111,INDIRECT(\"'\"&$K$1&\"'!$A$1:$H$550\"),8,FALSE))","v":"Not Found"},{"$f":"IF(ISNA(VLOOKUP(E111,INDIRECT(\"'\"&$K$1&\"'!$A$1:$H$550\"),5,FALSE)), \"0\", VLOOKUP(E111,INDIRECT(\"'\"&$K$1&\"'!$A$1:$H$550\"),5,FALSE))","v":"0"}]
["Social Responsibility & Ethics (ET)"]
["ET",null,null,3,{"$f":"IF(ISNA(INDEX(INDIRECT(\"'\"&$K$1&\"'!$A$1:$A$550\"), MATCH(\"*\"&A113&\"*\",INDIRECT(\"'\"&$K$1&\"'!$B$1:$B$550\"),0))), \"Not Found\", (INDEX(INDIRECT(\"'\"&$K$1&\"'!$A$1:$A$550\"), MATCH(\"*\"&A113&\"*\",INDIRECT(\"'\"&$K$1&\"'!$B$1:$B$550\"),0))))","v":"Not Found"},null,null,{"$f":"IF(ISNA(VLOOKUP(E113,INDIRECT(\"'\"&$K$1&\"'!$A$1:$H$550\"),8,FALSE)), \"Not Found\", VLOOKUP(E113,INDIRECT(\"'\"&$K$1&\"'!$A$1:$H$550\"),8,FALSE))","v":"Not Found"},{"$f":"IF(ISNA(VLOOKUP(E113,INDIRECT(\"'\"&$K$1&\"'!$A$1:$H$550\"),5,FALSE)), \"0\", VLOOKUP(E113,INDIRECT(\"'\"&$K$1&\"'!$A$1:$H$550\"),5,FALSE))","v":"0"}]
[]
["Degree Credits",null,null,null,null,null,null,null,"Projected Degree Credits "]
[null,null,null,{"$f":"SUM(D1:D23, D31:D60,D76,D89,D90,D94:D100)","v":120},null,null,null,null,{"$f":"SUM(I1:I23, I31:I60,I76,I89,I90,I94:I100)","v":0}]

{"sheet":"Graduation_Plan-Biocheminfo","index":13,"n_rows":399,"n_cols":8,"rows_kept":399,"cut":false,"hidden":false,"merged":[[3,0,3,1],[3,2,3,5],[0,0,0,5],[1,0,1,1],[1,2,1,5],[2,0,2,1],[2,2,2,5],[4,0,4,1],[4,2,4,5],[5,0,5,1],[5,2,5,5],[6,0,6,1],[6,2,6,5],[13,0,13,6],[7,0,7,1],[7,2,7,5],[8,0,8,1],[8,2,8,5],[9,0,9,1],[9,2,9,5],[10,0,10,6],[11,0,11,3],[11,4,11,5],[12,0,12,3],[12,4,12,5],[96,2,96,5],[14,0,14,3],[15,0,15,6],[16,0,16,5],[17,0,17,5],[69,0,69,2],[70,0,70,2],[71,0,71,6],[72,0,72,5],[73,2,73,5],[87,0,87,6],[88,2,88,5],[172,0,172,5],[110,0,110,6],[111,2,111,5],[121,0,121,6],[122,0,122,5],[123,2,123,5],[137,0,137,6],[138,2,138,5],[146,2,146,5],[160,0,160,6],[161,2,161,5],[171,0,171,6],[246,2,246,5],[173,2,173,6],[187,0,187,6],[188,2,188,5],[196,2,196,5],[210,0,210,6],[211,2,211,5],[221,0,221,6],[222,0,222,5],[223,2,223,5],[237,0,237,6],[238,2,238,5],[322,0,322,5],[260,0,260,6],[261,2,261,5],[271,0,271,6],[272,0,272,5],[273,2,273,5],[287,0,287,6],[288,2,288,5],[296,2,296,5],[310,0,310,6],[311,2,311,5],[321,0,321,6],[379,1,380,3],[379,4,380,4],[323,2,323,5],[337,0,337,6],[338,2,338,5],[346,2,346,5],[360,0,360,6],[361,2,361,5],[371,0,371,6],[373,1,373,4],[375,1,376,3],[375,4,376,4],[377,1,377,3],[399,1,399,4],[381,1,381,3],[383,1,384,3],[383,4,384,4],[385,1,385,3],[387,1,388,3],[387,4,388,4],[389,1,389,3],[391,1,392,3],[391,4,392,4],[393,1,393,3],[398,1,398,4]]}
["Computer Science Graduation Plan"]
["Student Name",null,"Last Name, First Name"]
["University Id (not ss#)"]
["Email"]
["Primary Major (Option)",null,"Computer Science (Bio-cheminfomatics)"]
["Second Major:"]
["Third Major:"]
["Minors(s):"]
["Special Program(s):"]
["Scholarships:"]
[]
["Matriculation Date (Month/Year)",null,null,null,"Sept. 2016"]
["Expected Graduation Date (Month/Year)",null,null,null,"June 2020"]
[]
["Minimum Number of Credits Required for Degree(s)",null,null,null,120]
[]
["Transfer and AP Credits"]
[]
["Course","Req.","Req.","Course Title","Credits","Grade","Degree Credits","SemesterYear"]
[null,null,null,null,null,null,null,"Transfer/AP"]
[null,null,null,null,null,null,null,"Transfer/AP"]
[null,null,null,null,null,null,null,"Transfer/AP"]
[null,null,null,null,null,null,null,"Transfer/AP"]
[null,null,null,null,null,null,null,"Transfer/AP"]
[null,null,null,null,null,null,null,"Transfer/AP"]
[null,null,null,null,null,null,null,"Transfer/AP"]
[null,null,null,null,null,null,null,"Transfer/AP"]
[null,null,null,null,null,null,null,"Transfer/AP"]
[null,null,null,null,null,null,null,"Transfer/AP"]
[null,null,null,null,null,null,null,"Transfer/AP"]
[null,null,null,null,null,null,null,"Transfer/AP"]
[null,null,null,null,null,null,null,"Transfer/AP"]
[null,null,null,null,null,null,null,"Transfer/AP"]
[null,null,null,null,null,null,null,"Transfer/AP"]
[null,null,null,null,null,null,null,"Transfer/AP"]
[null,null,null,null,null,null,null,"Transfer/AP"]
[null,null,null,null,null,null,null,"Transfer/AP"]
[null,null,null,null,null,null,null,"Transfer/AP"]
[null,null,null,null,null,null,null,"Transfer/AP"]
[null,null,null,null,null,null,null,"Transfer/AP"]
[null,null,null,null,null,null,null,"Transfer/AP"]
[null,null,null,null,null,null,null,"Transfer/AP"]
[null,null,null,null,null,null,null,"Transfer/AP"]
[null,null,null,null,null,null,null,"Transfer/AP"]
[null,null,null,null,null,null,null,"Transfer/AP"]
[null,null,null,null,null,null,null,"Transfer/AP"]
[null,null,null,null,null,null,null,"Transfer/AP"]
[null,null,null,null,null,null,null,"Transfer/AP"]
[null,null,null,null,null,null,null,"Transfer/AP"]
[null,null,null,null,null,null,null,"Transfer/AP"]
[null,null,null,null,null,null,null,"Transfer/AP"]
[null,null,null,null,null,null,null,"Transfer/AP"]
[null,null,null,null,null,null,null,"Transfer/AP"]
[null,null,null,null,null,null,null,"Transfer/AP"]
[null,null,null,null,null,null,null,"Transfer/AP"]
[null,null,null,null,null,null,null,"Transfer/AP"]
[null,null,null,null,null,null,null,"Transfer/AP"]
[null,null,null,null,null,null,null,"Transfer/AP"]
[null,null,null,null,null,null,null,"Transfer/AP"]
[null,null,null,null,null,null,null,"Transfer/AP"]
[null,null,null,null,null,null,null,"Transfer/AP"]
[null,null,null,null,null,null,null,"Transfer/AP"]
[null,null,null,null,null,null,null,"Transfer/AP"]
[null,null,null,null,null,null,null,"Transfer/AP"]
[null,null,null,null,null,null,null,"Transfer/AP"]
[null,null,null,null,null,null,null,"Transfer/AP"]
[null,null,null,null,null,null,null,"Transfer/AP"]
[null,null,null,null,null,null,null,"Transfer/AP"]
[null,null,null,null,null,null,null,"Transfer/AP"]
[" "," ",null,"Transfer and AP Credits",{"$f":"SUM(E20:E69)","v":0},null,{"$f":"SUM(G20:G69)","v":0}]
[" "," ",null,"Total Credits Earned",{"$f":"E70","v":0},null,{"$f":"E15-G70","v":120}]
[]
["Year 1"]
["Fall","2015",{"$f":"C2","v":"Last Name, First Name"}]
["Course",{"$f":"B19","v":"Req."},{"$f":"C19","v":"Req."},"Course Title","Credits","Grade","Degree Credits","SemesterYear"]
[null,null,null,null,null,null,null,{"$f":"$A$74&$B$74","v":"Fall2015"}]
[null,null,null,null,null,null,null,{"$f":"$A$74&$B$74","v":"Fall2015"}]
[null,null,null,null,null,null,null,"Fall2015"]
[null,null,null,null,null,null,null,"Fall2015"]
[null,null,null,null,null,null,null,"Fall2015"]
[null,null,null,null,null,null,null,"Fall2015"]
[null,null,null,null,null,null,null,"Fall2015"]
[null,null,null,null,null,null,null,"Fall2015"]
[null,null,null,null,null,null,null,"Fall2015"]
[null,null,null,null,null,null,null,"Fall2015"]
[" "," ",null,"Semester Credits Earned",{"$f":"SUM(E76:E85)","v":0},null,{"$f":"SUM(G76:G85)","v":0}]
[" "," ",null,{"$f":"D71","v":"Total Credits Earned"},{"$f":"E71+E86","v":0},null,{"$f":"G71-G86","v":120}]
[]
["Winter",{"$f":"B74+1","v":2016},{"$f":"C2","v":"Last Name, First Name"}]
["Course",{"$f":"B19","v":"Req."},null,"Course Title","Credits","Grade","Degree Credits","SemesterYear"]
[null,null,null,null,null,null,null,{"$f":"$A$89&$B$89","v":"Winter2016"}]
[null,null,null,null,null,null,null,{"$f":"$A$89&$B$89","v":"Winter2016"}]
[null,null,null,null,null,null,null,"Winter2016"]
[" "," ",null,{"$f":"D86","v":"Semester Credits Earned"},{"$f":"SUM(E91:E93)","v":0},null,{"$f":"SUM(G91:G93)","v":0}]
[" "," ",null,{"$f":"D71","v":"Total Credits Earned"},{"$f":"E87+E94","v":0},null,{"$f":"G87-G94","v":120}]
[]
["Spring",{"$f":"B74+1","v":2016},{"$f":"C2","v":"Last Name, First Name"}]
["Course",{"$f":"B19","v":"Req."},{"$f":"C19","v":"Req."},"Course Title","Credits","Grade","Degree Credits","SemesterYear"]
[null,null,null,null,null,null,null,{"$f":"$A$97&$B$97","v":"Spring2016"}]
[null,null,null,null,null,null,null,{"$f":"$A$97&$B$97","v":"Spring2016"}]
[null,null,null,null,null,null,null,"Spring2016"]
[null,null,null,null,null,null,null,"Spring2016"]
[null,null,null,null,null,null,null,"Spring2016"]
[null,null,null,null,null,null,null,"Spring2016"]
[null,null,null,null,null,null,null,"Spring2016"]
[null,null,null,null,null,null,null,"Spring2016"]
[null,null,null,null,null,null,null,"Spring2016"]
[null,null,null,null,null,null,null,"Spring2016"]
[" "," ",null,{"$f":"D86","v":"Semester Credits Earned"},{"$f":"SUM(E99:E108)","v":0},null,{"$f":"SUM(G99:G108)","v":0}]
[" "," ",null,{"$f":"D71","v":"Total Credits Earned"},{"$f":"E95+E109","v":0},null,{"$f":"G95-G109","v":120}]
[]
["Summer",{"$f":"B74+1","v":2016},{"$f":"C2","v":"Last Name, First Name"}]
["Course",{"$f":"B19","v":"Req."},{"$f":"C19","v":"Req."},"Course Title","Credits","Grade","Degree Credits","SemesterYear"]
[null,null,null,null,null,null,null,{"$f":"$A$112&$B$112","v":"Summer2016"}]
[null,null,null,null,null,null,null,{"$f":"$A$112&$B$112","v":"Summer2016"}]
[null,null,null,null,null,null,null,"Summer2016"]
[null,null,null,null,null,null,null,"Summer2016"]
[null,null,null,null,null,null,null,"Summer2016"]
[null,null,null,null,null,null,null,"Summer2016"]
[" "," ",null,{"$f":"D86","v":"Semester Credits Earned"},{"$f":"SUM(E114:E119)","v":0},null,{"$f":"SUM(G114:G119)","v":0}]
[" "," ",null,{"$f":"D71","v":"Total Credits Earned"},{"$f":"E110+E120","v":0},null,{"$f":"G110-G120","v":120}]
[]
["Year 2"]
["Fall",{"$f":"B74+1","v":2016},{"$f":"C2","v":"Last Name, First Name"}]
["Course",{"$f":"B19","v":"Req."},{"$f":"C19","v":"Req."},"Course Title","Credits","Grade","Degree Credits","SemesterYear"]
[null,null,null,null,null,null,null,{"$f":"$A$124&$B$124","v":"Fall2016"}]
[null,null,null,null,null,null,null,{"$f":"$A$124&$B$124","v":"Fall2016"}]
[null,null,null,null,null,null,null,"Fall2016"]
[null,null,null,null,null,null,null,"Fall2016"]
[null,null,null,null,null,null,null,"Fall2016"]
[null,null,null,null,null,null,null,"Fall2016"]
[null,null,null,null,null,null,null,"Fall2016"]
[null,null,null,null,null,null,null,"Fall2016"]
[null,null,null,null,null,null,null,"Fall2016"]
[null,null,null,null,null,null,null,"Fall2016"]
[" "," ",null,{"$f":"D86","v":"Semester Credits Earned"},{"$f":"SUM(E126:E135)","v":0},null,{"$f":"SUM(G126:G135)","v":0}]
[" "," ",null,{"$f":"D71","v":"Total Credits Earned"},{"$f":"E121+E136","v":0},null,{"$f":"G121-G136","v":120}]
[]
["Winter",{"$f":"B74+2","v":2017},{"$f":"C2","v":"Last Name, First Name"}]
["Course",{"$f":"B19","v":"Req."},{"$f":"C19","v":"Req."},"Course Title","Credits","Grade","Degree Credits","SemesterYear"]
[null,null,null,null,null,null,null,{"$f":"$A$139&$B$139","v":"Winter2017"}]
[null,null,null,null,null,null,null,{"$f":"$A$139&$B$139","v":"Winter2017"}]
[null,null,null,null,null,null,null,"Winter2017"]
[" "," ",null,{"$f":"D86","v":"Semester Credits Earned"},{"$f":"SUM(E141:E143)","v":0},null,{"$f":"SUM(G141:G143)","v":0}]
[" "," ",null,{"$f":"D71","v":"Total Credits Earned"},{"$f":"E137+E144","v":0},null,{"$f":"G137-G144","v":120}]
[]
["Spring",{"$f":"B89+1","v":2017},{"$f":"C2","v":"Last Name, First Name"}]
["Course",{"$f":"B19","v":"Req."},{"$f":"C19","v":"Req."},"Course Title","Credits","Grade","Degree Credits","SemesterYear"]
[null,null,null,null,null,null,null,{"$f":"$A$147&$B$147","v":"Spring2017"}]
[null,null,null,null,null,null,null,{"$f":"$A$147&$B$147","v":"Spring2017"}]
[null,null,null,null,null,null,null,"Spring2017"]
[null,null,null,null,null,null,null,"Spring2017"]
[null,null,null,null,null,null,null,"Spring2017"]
[null,null,null,null,null,null,null,"Spring2017"]
[null,null,null,null,null,null,null,"Spring2017"]
[null,null,null,null,null,null,null,"Spring2017"]
[null,null,null,null,null,null,null,"Spring2017"]
[null,null,null,null,null,null,null,"Spring2017"]
[" "," ",null,{"$f":"D86","v":"Semester Credits Earned"},{"$f":"SUM(E149:E158)","v":0},null,{"$f":"SUM(G149:G158)","v":0}]
[" "," ",null,{"$f":"D71","v":"Total Credits Earned"},{"$f":"E145+E159","v":0},null,{"$f":"G145-G159","v":120}]
[]
["Summer",{"$f":"B74+2","v":2017},{"$f":"C2","v":"Last Name, First Name"}]
["Course",{"$f":"B19","v":"Req."},{"$f":"C19","v":"Req."},"Course Title","Credits","Grade","Degree Credits","SemesterYear"]
[null,null,null,null,null,null,null,{"$f":"$A$162&$B$162","v":"Summer2017"}]
[null,null,null,null,null,null,null,{"$f":"$A$162&$B$162","v":"Summer2017"}]
[null,null,null,null,null,null,null,"Summer2017"]
[null,null,null,null,null,null,null,"Summer2017"]
[null,null,null,null,null,null,null,"Summer2017"]
[null,null,null,null,null,null,null,"Summer2017"]
[" "," ",null,{"$f":"D86","v":"Semester Credits Earned"},{"$f":"SUM(E164:E169)","v":0},null,{"$f":"SUM(G163:G169)","v":0}]
[" "," ",null,{"$f":"D71","v":"Total Credits Earned"},{"$f":"E160+E170","v":0},null,{"$f":"G160-G170","v":120}]
[]
["Year 3"]
["Fall",{"$f":"B74+2","v":2017},{"$f":"C2","v":"Last Name, First Name"}]
["Course",{"$f":"B19","v":"Req."},{"$f":"C19","v":"Req."},"Course Title","Credits","Grade","Degree Credits","SemesterYear"]
[null,null,null,null,null,null,null,{"$f":"$A$174&$B$174","v":"Fall2017"}]
[null,null,null,null,null,null,null,{"$f":"$A$174&$B$174","v":"Fall2017"}]
[null,null,null,null,null,null,null,"Fall2017"]
[null,null,null,null,null,null,null,"Fall2017"]
[null,null,null,null,null,null,null,"Fall2017"]
[null,null,null,null,null,null,null,"Fall2017"]
[null,null,null,null,null,null,null,"Fall2017"]
[null,null,null,null,null,null,null,"Fall2017"]
[null,null,null,null,null,null,null,"Fall2017"]
[null,null,null,null,null,null,null,"Fall2017"]
[" "," ",null,{"$f":"D86","v":"Semester Credits Earned"},{"$f":"SUM(E176:E185)","v":0},null,{"$f":"SUM(G176:G185)","v":0}]
[" "," ",null,{"$f":"D71","v":"Total Credits Earned"},{"$f":"E171+E186","v":0},null,{"$f":"G171-G186","v":120}]
[]
["Winter",{"$f":"B74+3","v":2018},{"$f":"C2","v":"Last Name, First Name"}]
["Course",{"$f":"B19","v":"Req."},{"$f":"C19","v":"Req."},"Course Title","Credits","Grade","Degree Credits","SemesterYear"]
[null,null,null,null,null,null,null,{"$f":"$A$189&$B$189","v":"Winter2018"}]
[null,null,null,null,null,null,null,{"$f":"$A$189&$B$189","v":"Winter2018"}]
[null,null,null,null,null,null,null,"Winter2018"]
[" "," ",null,{"$f":"D86","v":"Semester Credits Earned"},{"$f":"SUM(E191:E193)","v":0},null,{"$f":"SUM(G191:G193)","v":0},{"$f":"SUM(H191:H193)","v":0}]
[" "," ",null,{"$f":"D71","v":"Total Credits Earned"},{"$f":"E187+E194","v":0},null,{"$f":"G187-G194","v":120}]
[]
["Spring",{"$f":"B74+3","v":2018},{"$f":"C2","v":"Last Name, First Name"}]
["Course",{"$f":"B19","v":"Req."},{"$f":"C19","v":"Req."},"Course Title","Credits","Grade","Degree Credits","SemesterYear"]
[null,null,null,null,null,null,null,{"$f":"$A$197&$B$197","v":"Spring2018"}]
[null,null,null,null,null,null,null,{"$f":"$A$197&$B$197","v":"Spring2018"}]
[null,null,null,null,null,null,null,"Spring2018"]
[null,null,null,null,null,null,null,"Spring2018"]
[null,null,null,null,null,null,null,"Spring2018"]
[null,null,null,null,null,null,null,"Spring2018"]
[null,null,null,null,null,null,null,"Spring2018"]
[null,null,null,null,null,null,null,"Spring2018"]
[null,null,null,null,null,null,null,"Spring2018"]
[null,null,null,null,null,null,null,"Spring2018"]
[" "," ",null,{"$f":"D86","v":"Semester Credits Earned"},{"$f":"SUM(E199:E208)","v":0},null,{"$f":"SUM(G199:G208)","v":0}]
[" "," ",null,{"$f":"D71","v":"Total Credits Earned"},{"$f":"E195+E209","v":0},null,{"$f":"G195-G209","v":120}]
[]
["Summer",{"$f":"B74+3","v":2018},{"$f":"C2","v":"Last Name, First Name"}]
["Course",{"$f":"B19","v":"Req."},{"$f":"C19","v":"Req."},"Course Title","Credits","Grade","Degree Credits","SemesterYear"]
[null,null,null,null,null,null,null,{"$f":"$A$212&$B$212","v":"Summer2018"}]
[null,null,null,null,null,null,null,{"$f":"$A$212&$B$212","v":"Summer2018"}]
[null,null,null,null,null,null,null,"Summer2018"]
[null,null,null,null,null,null,null,"Summer2018"]
[null,null,null,null,null,null,null,"Summer2018"]
[null,null,null,null,null,null,null,"Summer2018"]
[" "," ",null,{"$f":"D86","v":"Semester Credits Earned"},{"$f":"SUM(E214:E219)","v":0},null,{"$f":"SUM(G213:G219)","v":0}]
[" "," ",null,{"$f":"D71","v":"Total Credits Earned"},{"$f":"E210+E220","v":0},null,{"$f":"G210-G220","v":120}]
[]
["Year 4"]
["Fall",{"$f":"B74+3","v":2018},{"$f":"C2","v":"Last Name, First Name"}]
["Course",{"$f":"B19","v":"Req."},{"$f":"C19","v":"Req."},"Course Title","Credits","Grade","Degree Credits","SemesterYear"]
[null,null,null,null,null,null,null,{"$f":"$A$224&$B$224","v":"Fall2018"}]
[null,null,null,null,null,null,null,{"$f":"$A$224&$B$224","v":"Fall2018"}]
[null,null,null,null,null,null,null,"Fall2018"]
[null,null,null,null,null,null,null,"Fall2018"]
[null,null,null,null,null,null,null,"Fall2018"]
[null,null,null,null,null,null,null,"Fall2018"]
[null,null,null,null,null,null,null,"Fall2018"]
[null,null,null,null,null,null,null,"Fall2018"]
[null,null,null,null,null,null,null,"Fall2018"]
[null,null,null,null,null,null,null,"Fall2018"]
[" "," ",null,{"$f":"D86","v":"Semester Credits Earned"},{"$f":"SUM(E226:E235)","v":0},null,{"$f":"SUM(G226:G235)","v":0}]
[" "," ",null,{"$f":"D71","v":"Total Credits Earned"},{"$f":"E221+E236","v":0},null,{"$f":"G221-G236","v":120}]
[]
["Winter",{"$f":"B74+4","v":2019},{"$f":"C2","v":"Last Name, First Name"}]
["Course",{"$f":"B19","v":"Req."},{"$f":"C19","v":"Req."},"Course Title","Credits","Grade","Degree Credits","SemesterYear"]
[null,null,null,null,null,null,null,{"$f":"$A$239&$B$239","v":"Winter2019"}]
[null,null,null,null,null,null,null,{"$f":"$A$239&$B$239","v":"Winter2019"}]
[null,null,null,null,null,null,null,"Winter2019"]
[" "," ",null,{"$f":"D86","v":"Semester Credits Earned"},{"$f":"SUM(E241:E243)","v":0},null,{"$f":"SUM(G241:G243)","v":0}]
[" "," ",null,{"$f":"D71","v":"Total Credits Earned"},{"$f":"E237+E244","v":0},null,{"$f":"G237-G244","v":120}]
[]
["Spring",{"$f":"B74+4","v":2019},{"$f":"C2","v":"Last Name, First Name"}]
["Course",{"$f":"B19","v":"Req."},{"$f":"C19","v":"Req."},"Course Title","Credits","Grade","Degree Credits","SemesterYear"]
[null,null,null,null,null,null,null,{"$f":"$A$247&$B$247","v":"Spring2019"}]
[null,null,null,null,null,null,null,{"$f":"$A$247&$B$247","v":"Spring2019"}]
[null,null,null,null,null,null,null,"Spring2019"]
[null,null,null,null,null,null,null,"Spring2019"]
[null,null,null,null,null,null,null,"Spring2019"]
[null,null,null,null,null,null,null,"Spring2019"]
[null,null,null,null,null,null,null,"Spring2019"]
[null,null,null,null,null,null,null,"Spring2019"]
[null,null,null,null,null,null,null,"Spring2019"]
[null,null,null,null,null,null,null,"Spring2019"]
[" "," ",null,{"$f":"D86","v":"Semester Credits Earned"},{"$f":"SUM(E249:E258)","v":0},null,{"$f":"SUM(G249:G258)","v":0}]
[" "," ",null,{"$f":"D71","v":"Total Credits Earned"},{"$f":"E245+E259","v":0},null,{"$f":"G245-G259","v":120}]
[]
["Summer",{"$f":"B74+4","v":2019},{"$f":"C2","v":"Last Name, First Name"}]
["Course",{"$f":"B19","v":"Req."},{"$f":"C19","v":"Req."},"Course Title","Credits","Grade","Degree Credits","SemesterYear"]
[null,null,null,null,null,null,null,{"$f":"$A$262&$B$262","v":"Summer2019"}]
[null,null,null,null,null,null,null,{"$f":"$A$262&$B$262","v":"Summer2019"}]
[null,null,null,null,null,null,null,"Summer2019"]
[null,null,null,null,null,null,null,"Summer2019"]
[null,null,null,null,null,null,null,"Summer2019"]
[null,null,null,null,null,null,null,"Summer2019"]
[" "," ",null,{"$f":"D86","v":"Semester Credits Earned"},{"$f":"SUM(E264:E269)","v":0},null,{"$f":"SUM(G263:G269)","v":0}]
[" "," ",null,{"$f":"D71","v":"Total Credits Earned"},{"$f":"E260+E270","v":0},null,{"$f":"G260-G270","v":120}]
[]
["Year 5"]
["Fall",{"$f":"B74+4","v":2019},{"$f":"C2","v":"Last Name, First Name"}]
["Course",{"$f":"B19","v":"Req."},{"$f":"C19","v":"Req."},"Course Title","Credits","Grade","Degree Credits","SemesterYear"]
[null,null,null,null,null,null,null,{"$f":"$A$274&$B$274","v":"Fall2019"}]
[null,null,null,null,null,null,null,{"$f":"$A$274&$B$274","v":"Fall2019"}]
[null,null,null,null,null,null,null,"Fall2019"]
[null,null,null,null,null,null,null,"Fall2019"]
[null,null,null,null,null,null,null,"Fall2019"]
[null,null,null,null,null,null,null,"Fall2019"]
[null,null,null,null,null,null,null,"Fall2019"]
[null,null,null,null,null,null,null,"Fall2019"]
[null,null,null,null,null,null,null,"Fall2019"]
[null,null,null,null,null,null,null,"Fall2019"]
[" "," ",null,{"$f":"D86","v":"Semester Credits Earned"},{"$f":"SUM(E276:E285)","v":0},null,{"$f":"SUM(G276:G285)","v":0}]
[" "," ",null,{"$f":"D71","v":"Total Credits Earned"},{"$f":"E271+E286","v":0},null,{"$f":"G271-G286","v":120}]
[]
["Winter",{"$f":"B74+5","v":2020},{"$f":"C2","v":"Last Name, First Name"}]
["Course",{"$f":"B19","v":"Req."},{"$f":"C19","v":"Req."},"Course Title","Credits","Grade","Degree Credits","SemesterYear"]
[null,null,null,null,null,null,null,{"$f":"$A$289&$B$289","v":"Winter2020"}]
[null,null,null,null,null,null,null,{"$f":"$A$289&$B$289","v":"Winter2020"}]
[null,null,null,null,null,null,null,"Winter2020"]
[" "," ",null,{"$f":"D86","v":"Semester Credits Earned"},{"$f":"SUM(E291:E293)","v":0},null,{"$f":"SUM(G291:G293)","v":0}]
[" "," ",null,{"$f":"D71","v":"Total Credits Earned"},{"$f":"E287+E294","v":0},null,{"$f":"G287-G294","v":120}]
[]
["Spring",{"$f":"B74+5","v":2020},{"$f":"C2","v":"Last Name, First Name"}]
["Course",{"$f":"B19","v":"Req."},{"$f":"C19","v":"Req."},"Course Title","Credits","Grade","Degree Credits","SemesterYear"]
[null,null,null,null,null,null,null,{"$f":"$A$297&$B$297","v":"Spring2020"}]
[null,null,null,null,null,null,null,{"$f":"$A$297&$B$297","v":"Spring2020"}]
[null,null,null,null,null,null,null,"Spring2020"]
[null,null,null,null,null,null,null,"Spring2020"]
[null,null,null,null,null,null,null,"Spring2020"]
[null,null,null,null,null,null,null,"Spring2020"]
[null,null,null,null,null,null,null,"Spring2020"]
[null,null,null,null,null,null,null,"Spring2020"]
[null,null,null,null,null,null,null,"Spring2020"]
[null,null,null,null,null,null,null,"Spring2020"]
[" "," ",null,{"$f":"D86","v":"Semester Credits Earned"},{"$f":"SUM(E299:E308)","v":0},null,{"$f":"SUM(G299:G308)","v":0}]
[" "," ",null,{"$f":"D71","v":"Total Credits Earned"},{"$f":"E295+E309","v":0},null,{"$f":"G295-G309","v":120}]
[]
["Summer",{"$f":"B74+5","v":2020},{"$f":"C2","v":"Last Name, First Name"}]
["Course",{"$f":"B19","v":"Req."},{"$f":"C19","v":"Req."},"Course Title","Credits","Grade","Degree Credits","SemesterYear"]
[null,null,null,null,null,null,null,{"$f":"$A$312&$B$312","v":"Summer2020"}]
[null,null,null,null,null,null,null,{"$f":"$A$312&$B$312","v":"Summer2020"}]
[null,null,null,null,null,null,null,"Summer2020"]
[null,null,null,null,null,null,null,"Summer2020"]
[null,null,null,null,null,null,null,"Summer2020"]
[null,null,null,null,null,null,null,"Summer2020"]
[" "," ",null,{"$f":"D86","v":"Semester Credits Earned"},{"$f":"SUM(E314:E319)","v":0},null,{"$f":"SUM(G313:G319)","v":0}]
[" "," ",null,{"$f":"D71","v":"Total Credits Earned"},{"$f":"E310+E320","v":0},null,{"$f":"G310-G320","v":120}]
[]
["Year 6"]
["Fall",{"$f":"B74+5","v":2020},{"$f":"C2","v":"Last Name, First Name"}]
["Course",{"$f":"B19","v":"Req."},{"$f":"C19","v":"Req."},"Course Title","Credits","Grade","Degree Credits","SemesterYear"]
[null,null,null,null,null,null,null,{"$f":"$A$324&$B$324","v":"Fall2020"}]
[null,null,null,null,null,null,null,{"$f":"$A$324&$B$324","v":"Fall2020"}]
[null,null,null,null,null,null,null,"Fall2020"]
[null,null,null,null,null,null,null,"Fall2020"]
[null,null,null,null,null,null,null,"Fall2020"]
[null,null,null,null,null,null,null,"Fall2020"]
[null,null,null,null,null,null,null,"Fall2020"]
[null,null,null,null,null,null,null,"Fall2020"]
[null,null,null,null,null,null,null,"Fall2020"]
[null,null,null,null,null,null,null,"Fall2020"]
[" "," ",null,{"$f":"D136","v":"Semester Credits Earned"},{"$f":"SUM(E326:E335)","v":0},null,{"$f":"SUM(G326:G335)","v":0}]
[" "," ",null,{"$f":"D121","v":"Total Credits Earned"},{"$f":"E321+E336","v":0},null,{"$f":"G321-G336","v":120}]
[]
["Winter",{"$f":"B74+6","v":2021},{"$f":"C2","v":"Last Name, First Name"}]
["Course",{"$f":"B19","v":"Req."},{"$f":"C19","v":"Req."},"Course Title","Credits","Grade","Degree Credits","SemesterYear"]
[null,null,null,null,null,null,null,{"$f":"$A$339&$B$339","v":"Winter2021"}]
[null,null,null,null,null,null,null,{"$f":"$A$339&$B$339","v":"Winter2021"}]
[null,null,null,null,null,null,null,"Winter2021"]
[" "," ",null,{"$f":"D136","v":"Semester Credits Earned"},{"$f":"SUM(E341:E343)","v":0},null,{"$f":"SUM(G341:G343)","v":0}]
[" "," ",null,{"$f":"D121","v":"Total Credits Earned"},{"$f":"E337+E344","v":0},null,{"$f":"G337-G344","v":120}]
[]
["Spring",{"$f":"B74+6","v":2021},{"$f":"C2","v":"Last Name, First Name"}]
["Course",{"$f":"B19","v":"Req."},{"$f":"C19","v":"Req."},"Course Title","Credits","Grade","Degree Credits","SemesterYear"]
[null,null,null,null,null,null,null,{"$f":"$A$347&$B$347","v":"Spring2021"}]
[null,null,null,null,null,null,null,{"$f":"$A$347&$B$347","v":"Spring2021"}]
[null,null,null,null,null,null,null,"Spring2021"]
[null,null,null,null,null,null,null,"Spring2021"]
[null,null,null,null,null,null,null,"Spring2021"]
[null,null,null,null,null,null,null,"Spring2021"]
[null,null,null,null,null,null,null,"Spring2021"]
[null,null,null,null,null,null,null,"Spring2021"]
[null,null,null,null,null,null,null,"Spring2021"]
[null,null,null,null,null,null,null,"Spring2021"]
[" "," ",null,{"$f":"D136","v":"Semester Credits Earned"},{"$f":"SUM(E349:E358)","v":0},null,{"$f":"SUM(G349:G358)","v":0}]
[" "," ",null,{"$f":"D121","v":"Total Credits Earned"},{"$f":"E345+E359","v":0},null,{"$f":"G345-G359","v":120}]
[]
["Summer",{"$f":"B74+6","v":2021},{"$f":"C2","v":"Last Name, First Name"}]
["Course",{"$f":"B19","v":"Req."},{"$f":"C19","v":"Req."},"Course Title","Credits","Grade","Degree Credits","SemesterYear"]
[null,null,null,null,null,null,null,{"$f":"$A$362&$B$362","v":"Summer2021"}]
[null,null,null,null,null,null,null,{"$f":"$A$362&$B$362","v":"Summer2021"}]
[null,null,null,null,null,null,null,"Summer2021"]
[null,null,null,null,null,null,null,"Summer2021"]
[null,null,null,null,null,null,null,"Summer2021"]
[null,null,null,null,null,null,null,"Summer2021"]
[" "," ",null,{"$f":"D136","v":"Semester Credits Earned"},{"$f":"SUM(E364:E369)","v":0},null,{"$f":"SUM(G363:G369)","v":0}]
[" "," ",null,{"$f":"D121","v":"Total Credits Earned"},{"$f":"E360+E370","v":0},null,{"$f":"G360-G370","v":120}]
[]
[]
[null,"Graduation Plan Review & Approval"]
[]
[]
[]
[null,"Initial Review: OASiS",null,null,"Date"]
[]
[]
[]
[null,"Additional Review: Faculty Mentor",null,null,"Date"]
[]
[null," ",null,null," "]
[]
[null,"Secondary Major Review",null,null,"Date"]
[]
[null," ",null,null," "]
[]
[null,"Final Review: OASiS Approval",null,null,"Date"]
[]
[null," ",null,null," "]
[]
[null,{"$f":"C2","v":"Last Name, First Name"},null,null,"Date"]
[]
[]
[]
[]
[null,"OASiS Comments"]

{"sheet":"Checklist Bio-cheminformatics","index":14,"n_rows":97,"n_cols":13,"rows_kept":97,"cut":false,"hidden":false,"merged":[[29,0,29,8],[0,0,0,8],[0,11,0,12],[1,4,1,6],[1,11,1,12],[2,0,2,8],[17,0,17,8],[21,0,21,8],[25,0,25,8],[26,0,26,2],[26,4,26,6],[27,0,27,8],[35,0,35,8],[40,0,40,8],[46,0,46,8],[46,11,46,12],[47,0,47,2],[47,4,47,6],[47,11,47,12],[68,0,68,8],[48,11,48,12],[58,0,58,8],[59,0,59,2],[59,4,59,6],[62,0,62,8],[63,0,63,2],[63,4,63,6],[66,0,66,8],[66,11,66,12],[67,0,67,2],[67,4,67,6],[67,11,67,12],[90,0,90,8],[92,0,92,8],[71,0,71,8],[73,0,73,8],[77,0,77,8],[81,0,81,8],[86,0,86,8],[89,0,89,8]]}
["Checklist -Bio/Cheminformatics",null,null,null,null,null,null,null,null,null,"Graduation_Plan","Required Bio/Cheminformatics Electives"]
["Requirement",null,null,"Credits","Taken",null,null,"Semester","Credits",null,null,"List courses you are interested in possibly taking. (NOTE: This is not required.)"]
["Required Computer Science Courses",null,null,null,null,null,null,null,null,null,null,"Course","Title"]
["COMP.1010","or","91.101",3,"COMP.1010","or","91.101",{"$f":"IF(AND(ISNA(VLOOKUP(E4,INDIRECT(\"'\"&$K$1&\"'!$A$1:$H$550\"),8,FALSE)), ISNA(VLOOKUP(G4,INDIRECT(\"'\"&$K$1&\"'!$A$1:$H$550\"),8,FALSE))), \"Not Found\", (IF(ISNA(VLOOKUP(E4,INDIRECT(\"'\"&$K$1&\"'!$A$1:$H$550\"),8,FALSE)), VLOOKUP(G4,INDIRECT(\"'\"&$K$1&\"'!$A$1:$H$550\"),8,FALSE), VLOOKUP(E4,INDIRECT(\"'\"&$K$1&\"'!$A$1:$H$550\"),8,FALSE))))","v":"Not Found"},{"$f":"IF(AND(ISNA(VLOOKUP(E4,INDIRECT(\"'\"&$K$1&\"'!$A$1:$H$550\"),5,FALSE)), ISNA(VLOOKUP(G4,INDIRECT(\"'\"&$K$1&\"'!$A$1:$H$550\"),5,FALSE))), \"0\", (IF(ISNA(VLOOKUP(E4,INDIRECT(\"'\"&$K$1&\"'!$A$1:$H$550\"),5,FALSE)), VLOOKUP(G4,INDIRECT(\"'\"&$K$1&\"'!$A$1:$H$550\"),5,FALSE), VLOOKUP(E4,INDIRECT(\"'\"&$K$1&\"'!$A$1:$H$550\"),5,FALSE))))","v":"0"}]
["COMP.1030L","or","91.103",1,"COMP.1030L","or","91.103",{"$f":"IF(AND(ISNA(VLOOKUP(E5,INDIRECT(\"'\"&$K$1&\"'!$A$1:$H$550\"),8,FALSE)), ISNA(VLOOKUP(G5,INDIRECT(\"'\"&$K$1&\"'!$A$1:$H$550\"),8,FALSE))), \"Not Found\", (IF(ISNA(VLOOKUP(E5,INDIRECT(\"'\"&$K$1&\"'!$A$1:$H$550\"),8,FALSE)), VLOOKUP(G5,INDIRECT(\"'\"&$K$1&\"'!$A$1:$H$550\"),8,FALSE), VLOOKUP(E5,INDIRECT(\"'\"&$K$1&\"'!$A$1:$H$550\"),8,FALSE))))","v":"Not Found"},{"$f":"IF(AND(ISNA(VLOOKUP(E5,INDIRECT(\"'\"&$K$1&\"'!$A$1:$H$550\"),5,FALSE)), ISNA(VLOOKUP(G5,INDIRECT(\"'\"&$K$1&\"'!$A$1:$H$550\"),5,FALSE))), \"0\", (IF(ISNA(VLOOKUP(E5,INDIRECT(\"'\"&$K$1&\"'!$A$1:$H$550\"),5,FALSE)), VLOOKUP(G5,INDIRECT(\"'\"&$K$1&\"'!$A$1:$H$550\"),5,FALSE), VLOOKUP(E5,INDIRECT(\"'\"&$K$1&\"'!$A$1:$H$550\"),5,FALSE))))","v":"0"}]
["COMP.1020","or","91.102",3,"COMP.1020","or","91.102","Not Found","0"]
["COMP.1040L","or","91.104",1,"COMP.1040L","or","91.104","Not Found","0"]
["COMP.2010","or","91.201",3,"COMP.2010","or","91.201","Not Found","0"]
["COMP.2010L",null,null,1,"COMP.2010L",null,null,{"$f":"IF(AND(ISNA(VLOOKUP(E9,INDIRECT(\"'\"&$K$1&\"'!$A$1:$H$550\"),8,FALSE)), ISNA(VLOOKUP(G9,INDIRECT(\"'\"&$K$1&\"'!$A$1:$H$550\"),8,FALSE))), \"Not Found\", (IF(ISNA(VLOOKUP(E9,INDIRECT(\"'\"&$K$1&\"'!$A$1:$H$550\"),8,FALSE)), VLOOKUP(G9,INDIRECT(\"'\"&$K$1&\"'!$A$1:$H$550\"),8,FALSE), VLOOKUP(E9,INDIRECT(\"'\"&$K$1&\"'!$A$1:$H$550\"),8,FALSE))))","v":"Not Found"},{"$f":"IF(AND(ISNA(VLOOKUP(E9,INDIRECT(\"'\"&$K$1&\"'!$A$1:$H$550\"),5,FALSE)), ISNA(VLOOKUP(G9,INDIRECT(\"'\"&$K$1&\"'!$A$1:$H$550\"),5,FALSE))), \"0\", (IF(ISNA(VLOOKUP(E9,INDIRECT(\"'\"&$K$1&\"'!$A$1:$H$550\"),5,FALSE)), VLOOKUP(G9,INDIRECT(\"'\"&$K$1&\"'!$A$1:$H$550\"),5,FALSE), VLOOKUP(E9,INDIRECT(\"'\"&$K$1&\"'!$A$1:$H$550\"),5,FALSE))))","v":"0"}]
["COMP.2030","or","91.203",3,"COMP.2030","or","91.203","Not Found","0"]
["COMP.2030L",null,null,1,"COMP.2030L",null,null,{"$f":"IF(AND(ISNA(VLOOKUP(E11,INDIRECT(\"'\"&$K$1&\"'!$A$1:$H$550\"),8,FALSE)), ISNA(VLOOKUP(G11,INDIRECT(\"'\"&$K$1&\"'!$A$1:$H$550\"),8,FALSE))), \"Not Found\", (IF(ISNA(VLOOKUP(E11,INDIRECT(\"'\"&$K$1&\"'!$A$1:$H$550\"),8,FALSE)), VLOOKUP(G11,INDIRECT(\"'\"&$K$1&\"'!$A$1:$H$550\"),8,FALSE), VLOOKUP(E11,INDIRECT(\"'\"&$K$1&\"'!$A$1:$H$550\"),8,FALSE))))","v":"Not Found"},{"$f":"IF(AND(ISNA(VLOOKUP(E11,INDIRECT(\"'\"&$K$1&\"'!$A$1:$H$550\"),5,FALSE)), ISNA(VLOOKUP(G11,INDIRECT(\"'\"&$K$1&\"'!$A$1:$H$550\"),5,FALSE))), \"0\", (IF(ISNA(VLOOKUP(E11,INDIRECT(\"'\"&$K$1&\"'!$A$1:$H$550\"),5,FALSE)), VLOOKUP(G11,INDIRECT(\"'\"&$K$1&\"'!$A$1:$H$550\"),5,FALSE), VLOOKUP(E11,INDIRECT(\"'\"&$K$1&\"'!$A$1:$H$550\"),5,FALSE))))","v":"0"}]
["COMP.2040","or","91.204",3,"COMP.2040","or","91.204","Not Found","0"]
["COMP.3010","or","91.301",3,"COMP.3010","or","91.301","Not Found","0"]
["COMP.3040","or","91.304",3,"COMP.3040","or","91.304","Not Found","0"]
["COMP.3050","or","91.305",3,"COMP.3050","or","91.305","Not Found","0"]
["COMP.3080","or","91.308",3,"COMP.3080","or","91.308","Not Found","0"]
["COMP.4040","or","91.404",3,"COMP.4040","or","91.404","Not Found","0"]
["Req. Bio/Cheminformatics Electives (BCIE)"]
["BCIE-1",null,null,3,{"$f":"IF(ISNA(INDEX(INDIRECT(\"'\"&$K$1&\"'!$A$1:$A$550\"), MATCH(A19,INDIRECT(\"'\"&$K$1&\"'!$B$1:$B$550\"),0))), \"Not Found\", (INDEX(INDIRECT(\"'\"&$K$1&\"'!$A$1:$A$550\"), MATCH(A19,INDIRECT(\"'\"&$K$1&\"'!$B$1:$B$550\"),0))))","v":"Not Found"},null,null,{"$f":"IF(ISNA(VLOOKUP(E19,INDIRECT(\"'\"&$K$1&\"'!$A$1:$H$550\"),8,FALSE)), \"Not Found\", VLOOKUP(E19,INDIRECT(\"'\"&$K$1&\"'!$A$1:$H$550\"),8,FALSE))","v":"Not Found"},{"$f":"IF(ISNA(VLOOKUP(E19,INDIRECT(\"'\"&$K$1&\"'!$A$1:$H$550\"),5,FALSE)), \"0\", VLOOKUP(E19,INDIRECT(\"'\"&$K$1&\"'!$A$1:$H$550\"),5,FALSE))","v":"0"}]
["BCIE-2",null,null,3,{"$f":"IF(ISNA(INDEX(INDIRECT(\"'\"&$K$1&\"'!$A$1:$A$550\"), MATCH(A20,INDIRECT(\"'\"&$K$1&\"'!$B$1:$B$550\"),0))), \"Not Found\", (INDEX(INDIRECT(\"'\"&$K$1&\"'!$A$1:$A$550\"), MATCH(A20,INDIRECT(\"'\"&$K$1&\"'!$B$1:$B$550\"),0))))","v":"Not Found"},null,null,"Not Found","0"]
["BCIE-3",null,null,3,{"$f":"IF(ISNA(INDEX(INDIRECT(\"'\"&$K$1&\"'!$A$1:$A$550\"), MATCH(A21,INDIRECT(\"'\"&$K$1&\"'!$B$1:$B$550\"),0))), \"Not Found\", (INDEX(INDIRECT(\"'\"&$K$1&\"'!$A$1:$A$550\"), MATCH(A21,INDIRECT(\"'\"&$K$1&\"'!$B$1:$B$550\"),0))))","v":"Not Found"},null,null,"Not Found","0"]
["CS Project Course"]
["Sr.Prj-1",null,null,3,{"$f":"IF(ISNA(INDEX(INDIRECT(\"'\"&$K$1&\"'!$A$1:$A$550\"), MATCH(A23,INDIRECT(\"'\"&$K$1&\"'!$B$1:$B$550\"),0))), \"Not Found\", (INDEX(INDIRECT(\"'\"&$K$1&\"'!$A$1:$A$550\"), MATCH(A23,INDIRECT(\"'\"&$K$1&\"'!$B$1:$B$550\"),0))))","v":"Not Found"},null,null,"Not Found","0"]
["Sr.Prj-2",null,null,3,{"$f":"IF(ISNA(INDEX(INDIRECT(\"'\"&$K$1&\"'!$A$1:$A$550\"), MATCH(A24,INDIRECT(\"'\"&$K$1&\"'!$B$1:$B$550\"),0))), \"Not Found\", (INDEX(INDIRECT(\"'\"&$K$1&\"'!$A$1:$A$550\"), MATCH(A24,INDIRECT(\"'\"&$K$1&\"'!$B$1:$B$550\"),0))))","v":"Not Found"},null,null,"Not Found","0"]
[]
["Required Supporting Technical Courses"]
["Requirement",null,null,"Credits","Taken",null,null,"Semester","Credits"]
["Electrical Engineering"]
["EECE.2650","or","16.265",3,"EECE.2650","or","16.265",{"$f":"IF(AND(ISNA(VLOOKUP(E29,INDIRECT(\"'\"&$K$1&\"'!$A$1:$H$550\"),8,FALSE)), ISNA(VLOOKUP(G29,INDIRECT(\"'\"&$K$1&\"'!$A$1:$H$550\"),8,FALSE))), \"Not Found\", (IF(ISNA(VLOOKUP(E29,INDIRECT(\"'\"&$K$1&\"'!$A$1:$H$550\"),8,FALSE)), VLOOKUP(G29,INDIRECT(\"'\"&$K$1&\"'!$A$1:$H$550\"),8,FALSE), VLOOKUP(E29,INDIRECT(\"'\"&$K$1&\"'!$A$1:$H$550\"),8,FALSE))))","v":"Not Found"},{"$f":"IF(AND(ISNA(VLOOKUP(E29,INDIRECT(\"'\"&$K$1&\"'!$A$1:$H$550\"),5,FALSE)), ISNA(VLOOKUP(G29,INDIRECT(\"'\"&$K$1&\"'!$A$1:$H$550\"),5,FALSE))), \"0\", (IF(ISNA(VLOOKUP(E29,INDIRECT(\"'\"&$K$1&\"'!$A$1:$H$550\"),5,FALSE)), VLOOKUP(G29,INDIRECT(\"'\"&$K$1&\"'!$A$1:$H$550\"),5,FALSE), VLOOKUP(E29,INDIRECT(\"'\"&$K$1&\"'!$A$1:$H$550\"),5,FALSE))))","v":"0"}]
["Mathematics"]
["MATH.1310","or","92.131",4,"MATH.1310","or","92.131",{"$f":"IF(AND(ISNA(VLOOKUP(E31,INDIRECT(\"'\"&$K$1&\"'!$A$1:$H$550\"),8,FALSE)), ISNA(VLOOKUP(G31,INDIRECT(\"'\"&$K$1&\"'!$A$1:$H$550\"),8,FALSE))), \"Not Found\", (IF(ISNA(VLOOKUP(E31,INDIRECT(\"'\"&$K$1&\"'!$A$1:$H$550\"),8,FALSE)), VLOOKUP(G31,INDIRECT(\"'\"&$K$1&\"'!$A$1:$H$550\"),8,FALSE), VLOOKUP(E31,INDIRECT(\"'\"&$K$1&\"'!$A$1:$H$550\"),8,FALSE))))","v":"Not Found"},{"$f":"IF(AND(ISNA(VLOOKUP(E31,INDIRECT(\"'\"&$K$1&\"'!$A$1:$H$550\"),5,FALSE)), ISNA(VLOOKUP(G31,INDIRECT(\"'\"&$K$1&\"'!$A$1:$H$550\"),5,FALSE))), \"0\", (IF(ISNA(VLOOKUP(E31,INDIRECT(\"'\"&$K$1&\"'!$A$1:$H$550\"),5,FALSE)), VLOOKUP(G31,INDIRECT(\"'\"&$K$1&\"'!$A$1:$H$550\"),5,FALSE), VLOOKUP(E31,INDIRECT(\"'\"&$K$1&\"'!$A$1:$H$550\"),5,FALSE))))","v":"0"}]
["MATH.1320","or","92.132",4,"MATH.1320","or","92.132","Not Found","0"]
["MATH.3210","or","92.321",3,"MATH.3210","or","92.321","Not Found","0"]
["MATH.3220","or","92.322",3,"MATH.3220","or","92.322","Not Found","0"]
["MATH.3860","or","92.386",3,"MATH.3860","or","92.386","Not Found","0"]
["Biology"]
["BIOL.1110","or","81.111",3,"BIOL.1110","or","81.111",{"$f":"IF(AND(ISNA(VLOOKUP(E37,INDIRECT(\"'\"&$K$1&\"'!$A$1:$H$550\"),8,FALSE)), ISNA(VLOOKUP(G37,INDIRECT(\"'\"&$K$1&\"'!$A$1:$H$550\"),8,FALSE))), \"Not Found\", (IF(ISNA(VLOOKUP(E37,INDIRECT(\"'\"&$K$1&\"'!$A$1:$H$550\"),8,FALSE)), VLOOKUP(G37,INDIRECT(\"'\"&$K$1&\"'!$A$1:$H$550\"),8,FALSE), VLOOKUP(E37,INDIRECT(\"'\"&$K$1&\"'!$A$1:$H$550\"),8,FALSE))))","v":"Not Found"},{"$f":"IF(AND(ISNA(VLOOKUP(E37,INDIRECT(\"'\"&$K$1&\"'!$A$1:$H$550\"),5,FALSE)), ISNA(VLOOKUP(G37,INDIRECT(\"'\"&$K$1&\"'!$A$1:$H$550\"),5,FALSE))), \"0\", (IF(ISNA(VLOOKUP(E37,INDIRECT(\"'\"&$K$1&\"'!$A$1:$H$550\"),5,FALSE)), VLOOKUP(G37,INDIRECT(\"'\"&$K$1&\"'!$A$1:$H$550\"),5,FALSE), VLOOKUP(E37,INDIRECT(\"'\"&$K$1&\"'!$A$1:$H$550\"),5,FALSE))))","v":"0"}]
["BIOL.1170L","or","81.117",1,"BIOL.1170L","or","81.117","Not Found","0"]
["BIOL.2350","or","81.235",3,"BIOL.2350","or","81.235","Not Found","0"]
["BIOL.2370","or","81.237",1,"BIOL.2370","or","81.237","Not Found","0"]
["Chemistry"]
["CHEM.1210","or","84.121",3,"CHEM.1210","or","84.121",{"$f":"IF(AND(ISNA(VLOOKUP(E42,INDIRECT(\"'\"&$K$1&\"'!$A$1:$H$550\"),8,FALSE)), ISNA(VLOOKUP(G42,INDIRECT(\"'\"&$K$1&\"'!$A$1:$H$550\"),8,FALSE))), \"Not Found\", (IF(ISNA(VLOOKUP(E42,INDIRECT(\"'\"&$K$1&\"'!$A$1:$H$550\"),8,FALSE)), VLOOKUP(G42,INDIRECT(\"'\"&$K$1&\"'!$A$1:$H$550\"),8,FALSE), VLOOKUP(E42,INDIRECT(\"'\"&$K$1&\"'!$A$1:$H$550\"),8,FALSE))))","v":"Not Found"},{"$f":"IF(AND(ISNA(VLOOKUP(E42,INDIRECT(\"'\"&$K$1&\"'!$A$1:$H$550\"),5,FALSE)), ISNA(VLOOKUP(G42,INDIRECT(\"'\"&$K$1&\"'!$A$1:$H$550\"),5,FALSE))), \"0\", (IF(ISNA(VLOOKUP(E42,INDIRECT(\"'\"&$K$1&\"'!$A$1:$H$550\"),5,FALSE)), VLOOKUP(G42,INDIRECT(\"'\"&$K$1&\"'!$A$1:$H$550\"),5,FALSE), VLOOKUP(E42,INDIRECT(\"'\"&$K$1&\"'!$A$1:$H$550\"),5,FALSE))))","v":"0"}]
["CHEM.1230L","or","84.123",1,"CHEM.1230L","or","84.123","Not Found","0"]
["CHEM.1220","or","84.122",3,"CHEM.1220","or","84.122","Not Found","0"]
["CHEM.1240L","or","84.124",1,"CHEM.1240L","or","84.124","Not Found","0"]
[]
["Free Electives (FE)",null,null,null,null,null,null,null,null,null,null,"Free Electives"]
["Requirement",null,null,"Credits","Taken",null,null,"Semester","Credits",null,null,"List free electives you are interested in taking.  These cannot be below the level of a"]
["FE-1",null,null,3,{"$f":"IF(ISNA(INDEX(INDIRECT(\"'\"&$K$1&\"'!$A$1:$A$550\"), MATCH(\"*\"&A49&\"*\",INDIRECT(\"'\"&$K$1&\"'!$B$1:$B$550\"),0))), \"Not Found\", (INDEX(INDIRECT(\"'\"&$K$1&\"'!$A$1:$A$550\"), MATCH(\"*\"&A49&\"*\",INDIRECT(\"'\"&$K$1&\"'!$B$1:$B$550\"),0))))","v":"Not Found"},null,null,{"$f":"IF(ISNA(VLOOKUP(E49,INDIRECT(\"'\"&$K$1&\"'!$A$1:$H$550\"),8,FALSE)), \"Not Found\", VLOOKUP(E49,INDIRECT(\"'\"&$K$1&\"'!$A$1:$H$550\"),8,FALSE))","v":"Not Found"},{"$f":"IF(ISNA(VLOOKUP(E49,INDIRECT(\"'\"&$K$1&\"'!$A$1:$H$550\"),5,FALSE)), \"0\", VLOOKUP(E49,INDIRECT(\"'\"&$K$1&\"'!$A$1:$H$550\"),5,FALSE))","v":"0"},null,null,"required course.  Specific courses may be recommended for different CS tracks."]
["FE-2",null,null,3,"Not Found",null,null,"Not Found","0"]
["FE-3",null,null,3,"Not Found",null,null,"Not Found","0"]
["FE-4",null,null,3,"Not Found",null,null,"Not Found","0"]
["Not Req.",null,null,"n/a","Not Found",null,null,"Not Found","0"]
["Not Req.",null,null,"n/a","Not Found",null,null,"Not Found","0"]
[]
["Required FE Credits",null,null,null,null,null,null,"Projected Credits"]
[null,null,null,{"$f":"121-SUM(D4:D45,D70,D71,D75:D81)","v":12},null,null,null,null,{"$f":"SUM(I49:I55)","v":0}]
[]
["Oral & Written Communication"]
["Requirement",null,null,"Credits","Taken",null,null,"Semester","Credits"]
["ENGL.2200","or","42.220",3,"ENGL.2200","or","42.220",{"$f":"IF(AND(ISNA(VLOOKUP(E61,INDIRECT(\"'\"&$K$1&\"'!$A$1:$H$550\"),8,FALSE)), ISNA(VLOOKUP(G61,INDIRECT(\"'\"&$K$1&\"'!$A$1:$H$550\"),8,FALSE))), \"Not Found\", (IF(ISNA(VLOOKUP(E61,INDIRECT(\"'\"&$K$1&\"'!$A$1:$H$550\"),8,FALSE)), VLOOKUP(G61,INDIRECT(\"'\"&$K$1&\"'!$A$1:$H$550\"),8,FALSE), VLOOKUP(E61,INDIRECT(\"'\"&$K$1&\"'!$A$1:$H$550\"),8,FALSE))))","v":"Not Found"},{"$f":"IF(AND(ISNA(VLOOKUP(E61,INDIRECT(\"'\"&$K$1&\"'!$A$1:$H$550\"),5,FALSE)), ISNA(VLOOKUP(G61,INDIRECT(\"'\"&$K$1&\"'!$A$1:$H$550\"),5,FALSE))), \"0\", (IF(ISNA(VLOOKUP(E61,INDIRECT(\"'\"&$K$1&\"'!$A$1:$H$550\"),5,FALSE)), VLOOKUP(G61,INDIRECT(\"'\"&$K$1&\"'!$A$1:$H$550\"),5,FALSE), VLOOKUP(E61,INDIRECT(\"'\"&$K$1&\"'!$A$1:$H$550\"),5,FALSE))))","v":"0"}]
[]
["CS Ethics Requirement"]
["Requirement",null,null,"Credits","Taken",null,null,"Semester","Credits"]
["CSET",null,null,3,{"$f":"IF(ISNA(INDEX(INDIRECT(\"'\"&$K$1&\"'!$A$1:$A$550\"), MATCH(A65,INDIRECT(\"'\"&$K$1&\"'!$C$1:$C$550\"),0))), \"Not Found\", (INDEX(INDIRECT(\"'\"&$K$1&\"'!$A$1:$A$550\"), MATCH(A65,INDIRECT(\"'\"&$K$1&\"'!$C$1:$C$550\"),0))))","v":"Not Found"},null,null,{"$f":"IF(ISNA(VLOOKUP(E65,INDIRECT(\"'\"&$K$1&\"'!$A$1:$H$550\"),8,FALSE)), \"Not Found\", VLOOKUP(E65,INDIRECT(\"'\"&$K$1&\"'!$A$1:$H$550\"),8,FALSE))","v":"Not Found"},{"$f":"IF(ISNA(VLOOKUP(E65,INDIRECT(\"'\"&$K$1&\"'!$A$1:$H$550\"),5,FALSE)), \"0\", VLOOKUP(E65,INDIRECT(\"'\"&$K$1&\"'!$A$1:$H$550\"),5,FALSE))","v":"0"}]
[]
["Breadth of Knowledge",null,null,null,null,null,null,null,null,null,null," Breadth of Knowledge Requirements"]
["Requirement",null,null,"Credits","Taken",null,null,"Semester","Credits",null,null,"Select courses you are interested in taking to satisfy this Requirements."]
["College Writing",null,null,null,null,null,null,null,null,null,null,"Area","Title"]
["CW-1",null,null,3,{"$f":"IF(ISNA(INDEX(INDIRECT(\"'\"&$K$1&\"'!$A$1:$A$550\"), MATCH(A70,INDIRECT(\"'\"&$K$1&\"'!$B$1:$B$550\"),0))), \"Not Found\", (INDEX(INDIRECT(\"'\"&$K$1&\"'!$A$1:$A$550\"), MATCH(A70,INDIRECT(\"'\"&$K$1&\"'!$B$1:$B$550\"),0))))","v":"Not Found"},null,null,{"$f":"IF(ISNA(VLOOKUP(E70,INDIRECT(\"'\"&$K$1&\"'!$A$1:$H$550\"),8,FALSE)), \"Not Found\", VLOOKUP(E70,INDIRECT(\"'\"&$K$1&\"'!$A$1:$H$550\"),8,FALSE))","v":"Not Found"},{"$f":"IF(ISNA(VLOOKUP(E70,INDIRECT(\"'\"&$K$1&\"'!$A$1:$H$550\"),5,FALSE)), \"0\", VLOOKUP(E70,INDIRECT(\"'\"&$K$1&\"'!$A$1:$H$550\"),5,FALSE))","v":"0"}]
["CW-2",null,null,3,{"$f":"IF(ISNA(INDEX(INDIRECT(\"'\"&$K$1&\"'!$A$1:$A$550\"), MATCH(A71,INDIRECT(\"'\"&$K$1&\"'!$B$1:$B$550\"),0))), \"Not Found\", (INDEX(INDIRECT(\"'\"&$K$1&\"'!$A$1:$A$550\"), MATCH(A71,INDIRECT(\"'\"&$K$1&\"'!$B$1:$B$550\"),0))))","v":"Not Found"},null,null,"Not Found","0"]
["Mathematics"]
["MA",null,null,4,{"$f":"IF(ISNA(INDEX(INDIRECT(\"'\"&$K$1&\"'!$A$1:$A$550\"), MATCH(A73,INDIRECT(\"'\"&$K$1&\"'!$B$1:$B$550\"),0))), \"Not Found\", (INDEX(INDIRECT(\"'\"&$K$1&\"'!$A$1:$A$550\"), MATCH(A73,INDIRECT(\"'\"&$K$1&\"'!$B$1:$B$550\"),0))))","v":"Not Found"},null,null,{"$f":"IF(ISNA(VLOOKUP(E73,INDIRECT(\"'\"&$K$1&\"'!$A$1:$H$550\"),8,FALSE)), \"Not Found\", VLOOKUP(E73,INDIRECT(\"'\"&$K$1&\"'!$A$1:$H$550\"),8,FALSE))","v":"Not Found"},{"$f":"IF(ISNA(VLOOKUP(E73,INDIRECT(\"'\"&$K$1&\"'!$A$1:$H$550\"),5,FALSE)), \"0\", VLOOKUP(E73,INDIRECT(\"'\"&$K$1&\"'!$A$1:$H$550\"),5,FALSE))","v":"0"}]
["Arts & Humanities"]
["AH-1",null,null,3,{"$f":"IF(ISNA(INDEX(INDIRECT(\"'\"&$K$1&\"'!$A$1:$A$550\"), MATCH(\"*\"&A75&\"*\",INDIRECT(\"'\"&$K$1&\"'!$B$1:$B$550\"),0))), \"Not Found\", (INDEX(INDIRECT(\"'\"&$K$1&\"'!$A$1:$A$550\"), MATCH(\"*\"&A75&\"*\",INDIRECT(\"'\"&$K$1&\"'!$B$1:$B$550\"),0))))","v":"Not Found"},null,null,{"$f":"IF(ISNA(VLOOKUP(E75,INDIRECT(\"'\"&$K$1&\"'!$A$1:$H$550\"),8,FALSE)), \"Not Found\", VLOOKUP(E75,INDIRECT(\"'\"&$K$1&\"'!$A$1:$H$550\"),8,FALSE))","v":"Not Found"},{"$f":"IF(ISNA(VLOOKUP(E75,INDIRECT(\"'\"&$K$1&\"'!$A$1:$H$550\"),5,FALSE)), \"0\", VLOOKUP(E75,INDIRECT(\"'\"&$K$1&\"'!$A$1:$H$550\"),5,FALSE))","v":"0"}]
["AH-2",null,null,3,{"$f":"IF(ISNA(INDEX(INDIRECT(\"'\"&$K$1&\"'!$A$1:$A$550\"), MATCH(\"*\"&A76&\"*\",INDIRECT(\"'\"&$K$1&\"'!$B$1:$B$550\"),0))), \"Not Found\", (INDEX(INDIRECT(\"'\"&$K$1&\"'!$A$1:$A$550\"), MATCH(\"*\"&A76&\"*\",INDIRECT(\"'\"&$K$1&\"'!$B$1:$B$550\"),0))))","v":"Not Found"},null,null,"Not Found","0"]
["AH-3",null,null,3,{"$f":"IF(ISNA(INDEX(INDIRECT(\"'\"&$K$1&\"'!$A$1:$A$550\"), MATCH(\"*\"&A77&\"*\",INDIRECT(\"'\"&$K$1&\"'!$B$1:$B$550\"),0))), \"Not Found\", (INDEX(INDIRECT(\"'\"&$K$1&\"'!$A$1:$A$550\"), MATCH(\"*\"&A77&\"*\",INDIRECT(\"'\"&$K$1&\"'!$B$1:$B$550\"),0))))","v":"Not Found"},null,null,"Not Found","0"]
["Social Sciences"]
["SS-1",null,null,3,{"$f":"IF(ISNA(INDEX(INDIRECT(\"'\"&$K$1&\"'!$A$1:$A$550\"), MATCH(\"*\"&A79&\"*\",INDIRECT(\"'\"&$K$1&\"'!$B$1:$B$550\"),0))), \"Not Found\", (INDEX(INDIRECT(\"'\"&$K$1&\"'!$A$1:$A$550\"), MATCH(\"*\"&A79&\"*\",INDIRECT(\"'\"&$K$1&\"'!$B$1:$B$550\"),0))))","v":"Not Found"},null,null,{"$f":"IF(ISNA(VLOOKUP(E79,INDIRECT(\"'\"&$K$1&\"'!$A$1:$H$550\"),8,FALSE)), \"Not Found\", VLOOKUP(E79,INDIRECT(\"'\"&$K$1&\"'!$A$1:$H$550\"),8,FALSE))","v":"Not Found"},{"$f":"IF(ISNA(VLOOKUP(E79,INDIRECT(\"'\"&$K$1&\"'!$A$1:$H$550\"),5,FALSE)), \"0\", VLOOKUP(E79,INDIRECT(\"'\"&$K$1&\"'!$A$1:$H$550\"),5,FALSE))","v":"0"}]
["SS-2",null,null,3,{"$f":"IF(ISNA(INDEX(INDIRECT(\"'\"&$K$1&\"'!$A$1:$A$550\"), MATCH(\"*\"&A80&\"*\",INDIRECT(\"'\"&$K$1&\"'!$B$1:$B$550\"),0))), \"Not Found\", (INDEX(INDIRECT(\"'\"&$K$1&\"'!$A$1:$A$550\"), MATCH(\"*\"&A80&\"*\",INDIRECT(\"'\"&$K$1&\"'!$B$1:$B$550\"),0))))","v":"Not Found"},null,null,"Not Found","0"]
["SS-3",null,null,3,{"$f":"IF(ISNA(INDEX(INDIRECT(\"'\"&$K$1&\"'!$A$1:$A$550\"), MATCH(\"*\"&A81&\"*\",INDIRECT(\"'\"&$K$1&\"'!$B$1:$B$550\"),0))), \"Not Found\", (INDEX(INDIRECT(\"'\"&$K$1&\"'!$A$1:$A$550\"), MATCH(\"*\"&A81&\"*\",INDIRECT(\"'\"&$K$1&\"'!$B$1:$B$550\"),0))))","v":"Not Found"},null,null,"Not Found","0"]
["Sciences with Lab"]
["SC-1",null,null,3,{"$f":"IF(ISNA(INDEX(INDIRECT(\"'\"&$K$1&\"'!$A$1:$A$550\"), MATCH(A83,INDIRECT(\"'\"&$K$1&\"'!$B$1:$B$550\"),0))), \"Not Found\", (INDEX(INDIRECT(\"'\"&$K$1&\"'!$A$1:$A$550\"), MATCH(A83,INDIRECT(\"'\"&$K$1&\"'!$B$1:$B$550\"),0))))","v":"Not Found"},null,null,{"$f":"IF(ISNA(VLOOKUP(E83,INDIRECT(\"'\"&$K$1&\"'!$A$1:$H$550\"),8,FALSE)), \"Not Found\", VLOOKUP(E83,INDIRECT(\"'\"&$K$1&\"'!$A$1:$H$550\"),8,FALSE))","v":"Not Found"},{"$f":"IF(ISNA(VLOOKUP(E83,INDIRECT(\"'\"&$K$1&\"'!$A$1:$H$550\"),5,FALSE)), \"0\", VLOOKUP(E83,INDIRECT(\"'\"&$K$1&\"'!$A$1:$H$550\"),5,FALSE))","v":"0"}]
["SCL-1",null,null,1,{"$f":"IF(ISNA(INDEX(INDIRECT(\"'\"&$K$1&\"'!$A$1:$A$550\"), MATCH(A84,INDIRECT(\"'\"&$K$1&\"'!$B$1:$B$550\"),0))), \"Not Found\", (INDEX(INDIRECT(\"'\"&$K$1&\"'!$A$1:$A$550\"), MATCH(A84,INDIRECT(\"'\"&$K$1&\"'!$B$1:$B$550\"),0))))","v":"Not Found"},null,null,"Not Found","0"]
["SC-2",null,null,3,{"$f":"IF(ISNA(INDEX(INDIRECT(\"'\"&$K$1&\"'!$A$1:$A$550\"), MATCH(A85,INDIRECT(\"'\"&$K$1&\"'!$B$1:$B$550\"),0))), \"Not Found\", (INDEX(INDIRECT(\"'\"&$K$1&\"'!$A$1:$A$550\"), MATCH(A85,INDIRECT(\"'\"&$K$1&\"'!$B$1:$B$550\"),0))))","v":"Not Found"},null,null,"Not Found","0"]
["SCL-2",null,null,1,{"$f":"IF(ISNA(INDEX(INDIRECT(\"'\"&$K$1&\"'!$A$1:$A$550\"), MATCH(A86,INDIRECT(\"'\"&$K$1&\"'!$B$1:$B$550\"),0))), \"Not Found\", (INDEX(INDIRECT(\"'\"&$K$1&\"'!$A$1:$A$550\"), MATCH(A86,INDIRECT(\"'\"&$K$1&\"'!$B$1:$B$550\"),0))))","v":"Not Found"},null,null,"Not Found","0"]
["STEM"]
["STEM",null,null,3,{"$f":"IF(ISNA(INDEX(INDIRECT(\"'\"&$K$1&\"'!$A$1:$A$550\"), MATCH(A88,INDIRECT(\"'\"&$K$1&\"'!$B$1:$B$550\"),0))), \"Not Found\", (INDEX(INDIRECT(\"'\"&$K$1&\"'!$A$1:$A$550\"), MATCH(A88,INDIRECT(\"'\"&$K$1&\"'!$B$1:$B$550\"),0))))","v":"Not Found"},null,null,{"$f":"IF(ISNA(VLOOKUP(E88,INDIRECT(\"'\"&$K$1&\"'!$A$1:$H$550\"),8,FALSE)), \"Not Found\", VLOOKUP(E88,INDIRECT(\"'\"&$K$1&\"'!$A$1:$H$550\"),8,FALSE))","v":"Not Found"},{"$f":"IF(ISNA(VLOOKUP(E88,INDIRECT(\"'\"&$K$1&\"'!$A$1:$H$550\"),5,FALSE)), \"0\", VLOOKUP(E88,INDIRECT(\"'\"&$K$1&\"'!$A$1:$H$550\"),5,FALSE))","v":"0"}]
[]
["Diversity & Ethics ELOs"]
["Diversity & Cultural Awareness (DV)"]
["DV",null,null,3,{"$f":"IF(ISNA(INDEX(INDIRECT(\"'\"&$K$1&\"'!$A$1:$A$550\"), MATCH(\"*\"&A92&\"*\",INDIRECT(\"'\"&$K$1&\"'!$B$1:$B$550\"),0))), \"Not Found\", (INDEX(INDIRECT(\"'\"&$K$1&\"'!$A$1:$A$550\"), MATCH(\"*\"&A92&\"*\",INDIRECT(\"'\"&$K$1&\"'!$B$1:$B$550\"),0))))","v":"Not Found"},null,null,{"$f":"IF(ISNA(VLOOKUP(E92,INDIRECT(\"'\"&$K$1&\"'!$A$1:$H$550\"),8,FALSE)), \"Not Found\", VLOOKUP(E92,INDIRECT(\"'\"&$K$1&\"'!$A$1:$H$550\"),8,FALSE))","v":"Not Found"},{"$f":"IF(ISNA(VLOOKUP(E92,INDIRECT(\"'\"&$K$1&\"'!$A$1:$H$550\"),5,FALSE)), \"0\", VLOOKUP(E92,INDIRECT(\"'\"&$K$1&\"'!$A$1:$H$550\"),5,FALSE))","v":"0"}]
["Social Responsibility & Ethics (ET)"]
["ET",null,null,3,{"$f":"IF(ISNA(INDEX(INDIRECT(\"'\"&$K$1&\"'!$A$1:$A$550\"), MATCH(\"*\"&A94&\"*\",INDIRECT(\"'\"&$K$1&\"'!$B$1:$B$550\"),0))), \"Not Found\", (INDEX(INDIRECT(\"'\"&$K$1&\"'!$A$1:$A$550\"), MATCH(\"*\"&A94&\"*\",INDIRECT(\"'\"&$K$1&\"'!$B$1:$B$550\"),0))))","v":"Not Found"},null,null,{"$f":"IF(ISNA(VLOOKUP(E94,INDIRECT(\"'\"&$K$1&\"'!$A$1:$H$550\"),8,FALSE)), \"Not Found\", VLOOKUP(E94,INDIRECT(\"'\"&$K$1&\"'!$A$1:$H$550\"),8,FALSE))","v":"Not Found"},{"$f":"IF(ISNA(VLOOKUP(E94,INDIRECT(\"'\"&$K$1&\"'!$A$1:$H$550\"),5,FALSE)), \"0\", VLOOKUP(E94,INDIRECT(\"'\"&$K$1&\"'!$A$1:$H$550\"),5,FALSE))","v":"0"}]
[]
["Degree Credits",null,null,null,null,null,null,null,"Projected Degree Credits "]
[null,null,null,{"$f":"SUM(D4:D45,D57,D70,D71,D75:D81)","v":121},null,null,null,null,{"$f":"SUM(I4:I45,I57,I70,I71,I75:I81)","v":0}]